�w��,���ݒn,�ܓx,�o�x,�d�b�ԍ�,���ԏ�,�����,�g��җp�ݔ�,�d�b,���Y�̔����E�_�ѐ��Y������,���X�g����,�i���E�y�H,�x�e��,���񋟐ݔ�,����,�x�r�[�x�b�h,�W�]��,���ꕑ��E���p�ٓ������{��,����ۗ{�{��,�^����,�h���{��,�L�����v��,�K�\�����X�^���h,�V�����[,�|�X�g,�̌��{��,�}���[�i,�}���[�d��,�����N,������
���ˑ勴�L�O����,���쌧��o�s�Ԃ̏B�Β�6-13,34.352688,133.826126,0877-45-2344,��,��,��,��,��,,��,��,��,��,��,��,��,,,,,,,,,,��,2016,11
�Óc�̏���,���쌧���ʂ��s�Óc���Óc103-3,34.285254,134.253267,0879-42-5520,��,��,��,��,��,��,��,��,��,��,,,,,,,,,,,,,,2016,11
���ƂЂ�,���쌧�ω����s�L����3��37��,34.130624,133.643711,0875-24-2150,��,��,��,��,��,��,��,��,��,��,,��,��,,��,,,,,,,,,2016,11
�ӂꂠ���p�[�N�݂�,���쌧�O�L�s�O�쒬�匩��74�Ԓn,34.226349,133.722854,0875-72-5300,��,��,��,��,��,��,��,��,��,��,��,��,,��,��,��,,,,��,,,,2016,11
�������I���[�u����,���쌧�����S�������������b1941�Ԓn1,34.472861,134.273694,0879-82-2200,��,��,��,��,��,��,��,��,��,��,��,,,��,,��,,,,��,��,,��,2016,11
�������ӂ邳�Ƒ�,���쌧�����S������������2084-1,34.471185,134.23623,0879-75-2266,��,��,��,��,��,,��,��,��,��,,��,��,,��,��,��,,��,��,��,��,��,2016,11
��̖����݂̖؃p�[�N,���쌧�����x�S�܂�̂����Ǐ�424-1,34.154912,133.821619,0877-75-1994,��,��,��,��,��,��,,��,��,��,,��,,,,,,,,��,,,,2016,11
�݂낭,���쌧���ʂ��s��쒬�x�c��3298�Ԓn1,34.258188,134.242455,0879-43-0550,��,��,��,��,��,��,��,��,��,��,,,,,,,,,,,,,��,2016,11
�����̂�,���쌧�����s���]�������㓌�����]390�Ԓn21,34.170345,134.082046,087-893-1378,��,��,��,��,��,,,��,��,,,,,,,,,,,��,,,��,2016,11
��{,���쌧���̌S���쒬��{���쐼1578�Ԓn,34.249768,133.917361,087-876-5018,��,��,��,��,��,��,��,��,��,��,,,,,,,,,,��,��,,,2016,11
���ƂȂ�,���쌧�����x�S�܂�̂����쓌2355-1,34.094997,134.007559,0877-56-0015,��,��,��,��,��,��,��,��,��,,��,,,,,,,,,,,,,2016,11
���l�̐��n�@�����×ՊC����,���쌧���̌S�F���Ò��l��Ԓ�4�Ԓn,34.313395,133.807817,0877-49-0860,��,��,��,��,��,��,,��,��,��,��,��,,,,,,,,,��,,��,2016,11
�Ƃ�͂�,���쌧�ω����s�L�l�����Y���吼�b2506�Ԓn,34.042725,133.601411,0875-56-3655,��,��,��,��,��,��,��,��,��,��,,��,,,,,,,,,,,��,2016,11
�����炾�̗�������,���쌧�O�L�s���c�����c��180�Ԓn6,34.110164,133.797957,0875-67-2614,��,��,��,��,��,,��,��,��,��,,��,,��,��,��,,,,��,,,��,2016,11
����c�΋L�O����,���쌧�����S�y�������C�b909�Ԓn1,34.533938,134.242274,0879-65-2865,��,��,��,��,��,,��,��,��,,,,,,,,,,,,,��,,2016,11
�Ȃ���,���쌧���ʂ��s�O�R940��12,34.221308,134.175014,0879-52-1022,��,��,��,��,��,,,��,��,��,,,,,,,,,,,,,��,2016,11
����y��,���쌧�����s���쒬����997-2,34.239366,134.007315,087-815-8585,��,��,��,��,��,��,��,��,��,,��,,,��,,,,,,��,,,��,2016,11
�����̗��ނ�,���쌧�����s���璬��631�Ԓn7,34.333726,134.157495,087-845-6080,��,��,��,��,��,��,,��,��,��,��,,,,,,,,,,,,��,2016,11
