����,���̂��ȕ\�L,�Z���\�L,�X�֔ԍ�,�ܓx,�o�x,�d�b�ԍ�,�e�`�w�ԍ�,�d���[���A�h���X,Web�T�C�g,���,���{�ݎ��,�^��,�R����A�y�Η��y�ђn����,����,�n�k,�Ôg,��K�͂ȉΎ�,�����×�,�ΎR����,�Ώےn��,���e�\�l��,���͂�\��,���l
��N���w�Z,���Ƃ����傤��������,�����͎s�g�䒬��N263-1,839-1304,33.348487,130.770564,0943-75-2865,,,,��,�w���,��,,,��,,,,,��N�Z��,600,,
��N�R�~���j�e�B�Z���^�[,���Ƃ����݂�ɂĂ��[���񂽁[,�����͎s�g�䒬��N245-1,839-1304,33.34787,130.769657,0943-75-5622,0943-75-5622,,,��,�w���,��,,,��,,,,,��N�Z��,100,,
�g�䏬�w�Z,�悵�����傤��������,�����͎s�g�䒬1088,839-1321,33.344987,130.76135,0943-75-2018,,,,��,�w���,��,,,��,,,,,�g��Z��,600,,
���x���w�Z,�ӂ��ǂ݂��傤��������,�����͎s�g�䒬���v666-1,839-1332,33.333256,130.753645,0943-75-2437,,,,��,�w���,��,,,��,,,,,���x�Z��,500,,
���x�R�~���j�e�B�Z���^�[,�ӂ��ǂ݂��݂�ɂĂ��[���񂽁[,�����͎s�g�䒬���v1607-1,839-1332,33.332068,130.753773,0943-75-5771,0943-75-5771,,,��,�w���,��,,,��,,,,,���x�Z��,100,,
�]�쏬�w�Z,���Ȃ݂��傤��������,�����͎s�g�䒬���a�c774-1,839-1308,33.353669,130.743869,0943-75-2353,,,,��,�w���,��,,,��,,,,,�]��Z��,500,,
�]��R�~���j�e�B�Z���^�[,���Ȃ݂��݂�ɂĂ��[���񂽁[,�����͎s�g�䒬�V��1063-1,839-1306,33.352993,130.743479,0943-75-4389,0943-75-4389,,,��,�w���,��,,,��,,,,,�]��Z��,100,,
�g�䒆�w�Z,�悵�����イ������,�����͎s�g�䒬���i58,839-1305,33.346309,130.762574,0943-75-2010,,,,��,�w���,��,,,��,,,,,��N�Z��,1000,,
���U�w�K�Z���^�[,���傤�����������イ���񂽁[,�����͎s�g�䒬983-1,839-1321,33.346347,130.756431,0943-75-3343,,,,��,�w���,��,,,��,,,,,�g��Z��,700,��,
�i�`�ɂ��{��,�����������ɂ��ق񂵂�,�����͎s�g�䒬356-1,839-1321,33.343212,130.747743,0943-75-4121,,,,��,�w���,��,,,��,,,,,�g��Z��,1000,,
�g��̈�Z���^�[,�悵�������������񂽁[,�����͎s�g�䒬983-120,839-1321,33.345891,130.755828,0943-76-4423,,,,��,�w���,��,,,��,,,,,�g��Z��,1000,,
JA�ɂ����當���Z���^�[������,�����������ɂ����傤�����Ԃ񂩂��񂽁[������,�����͎s�g�䒬684-1,839-1321,33.343663,130.74808,0943-75-5801,,,,��,�w���,��,,,��,,,,,�g��Z��,100,,
���[�N���[���X�e�[�V����,�݂̂�����[�񂷂ā[�����,�����͎s�g�䒬�x�i2015,839-1333,33.336176,130.733073,0943-75-2066,,,,��,�w���,��,,,��,,,,,���x�Z��,500,,
�����͎s���������Z���^�[,�����͂����������ӂ������񂽁[,�����͎s�g�䒬347-1,839-1321,33.342003,130.748196,0943-76-3977,,,,��,�w���,��,,,��,,,,,�g��Z��,500,,
���H���^�ٍ��Z,�����͂��イ���񂩂񂱂�����,�����͎s�g�䒬���t658,839-1342,33.341877,130.732963,0943-75-2138,,,,��,�w���,��,,,��,,,,,�]��Z��,1000,,
�����͎s����,�����͂��₭����,�����͎s�g�䒬�V��316,839-1393,33.347482,130.754848,0943-75-2111,,,,��,�w���,��,,,��,,,,,�]��Z��,500,,
�򃖐��������,���܂��������݂񂩂�,�����͎s���H������2422-7,839-1415,33.309688,130.765751,,,,,��,�w���,��,,,��,,,,,����Z��,100,,
���쏬�w�Z,�������킵�傤��������,�����͎s���H������2285-2,839-1415,33.312373,130.770749,0943-77-2452,,,,��,�w���,��,��,,��,,,,,����Z��,400,,
�c�U�R�~���j�e�B�Z���^�[,�������肱�݂�ɂĂ��[���񂽁[,�����͎s���H���c�U1151-1,839-1414,33.271888,130.841788,0943-77-6776,0943-77-6776,,,��,�w���,��,,,��,,,,,�c�U�Z��,100,,
�P�����w�Z,�Ђ߂͂邵�傤��������,�����͎s���H���V��3934,839-1413,33.288173,130.818269,0943-77-3109,,,,��,�w���,��,��,,��,,,,,�V��Z��,400,,
�V��R�~���j�e�B�Z���^�[,�ɂ����킱�݂�ɂĂ��[���񂽁[,�����͎s���H���V��2515,839-1413,33.294297,130.806185,0943-77-6557,0943-77-6557,,,��,�w���,��,,,��,,,,,�V��Z��,100,,
�������w�Z,���������傤��������,�����͎s���H������2605-1,839-1412,33.311089,130.842875,0943-77-2670,,,,��,�w���,��,��,,��,,,,,�����Z��,400,,
�����R�~���j�e�B�Z���^�[,���������݂�ɂĂ��[���񂽁[,�����͎s���H������2548-1,839-1412,33.312163,130.839897,0943-77-4835,0943-77-4835,,,��,�w���,��,��,,��,,,,,�����Z��,100,,
�R�t���w�Z,��܂͂邵�傤��������,�����͎s���H���R�k783-6,839-1408,33.336524,130.827795,0943-77-2267,,,,��,�w���,��,,,��,,,,,�R�t�Z��,500,,
�R�t�R�~���j�e�B�Z���^�[,��܂͂邱�݂�ɂĂ��[���񂽁[,�����͎s���H���R�k783,839-1408,33.341023,130.826308,0943-77-4699,0943-77-4699,,,��,�w���,��,,,��,,,,,�R�t�Z��,200,,
��Ώ��w�Z,�����������傤��������,�����͎s���H���Ð�468-3,839-1405,33.355506,130.809296,0943-77-2259,,,,��,�w���,��,,,��,,,,,��΍Z��,500,,
��΃R�~���j�e�B�Z���^�[,�����������݂�ɂĂ��[���񂽁[,�����͎s���H���Ð�479,839-1405,33.355265,130.80844,0943-77-7088,0943-77-7088,,,��,�w���,��,,,��,,,,,��΍Z��,200,,
��K���w�Z,�݂䂫���傤��������,�����͎s���H�����c412,839-1401,33.332146,130.789849,0943-77-2035,,,,��,�w���,��,,,��,,,,,��K�Z��,700,,
�����͎s���z�[��,�����͂��݂�ف[��,�����͎s���H�����c561-1,839-1401,33.332493,130.791097,0943-77-7476,,,,��,�w���,��,,,��,,,,,��K�Z��,400,,
���H���w�Z,�����͂��イ��������,�����͎s���H�����G��344-1,839-1403,33.336514,130.802192,0943-77-2351,,,,��,�w���,��,,,��,,,,,��K�Z��,1000,,
��K�R�~���j�e�B�Z���^�[,�݂䂫���݂�ɂĂ����񂽁[,�����͎s���H�����c562-11,839-1401,33.333113,130.791547,0943-77-3367,,,,��,�w���,��,,,��,,,,,��K�Z��,100,��,
�����̓A���[�i,�����͂���[��,�����͎s���H�����c215,839-1401,33.339249,130.786488,0943-74-8080,,,,��,�w���,��,,,��,,,,,��K�Z��,2000,,
���̉w������,�݂��̂���������,�����͎s���H���R�k729-2,839-1408,33.334115,130.818293,0943-74-3939,,,,��,�w���,��,,,��,,,,,�R�t�Z��,500,,
��JA�ɂ���Ύx��,���イ�����������ɂ���������������,�����͎s���H������669-3,839-1406,33.350366,130.810429,,,,,��,�w���,��,,,��,,,,,��΍Z��,200,,
�����͎s���Z���^�[,�����͂��݂񂹂񂽁[,�����͎s���H�����c582-1,839-1401,33.33248,130.793136,0943-77-2112,,,,��,�w���,��,,,��,,,,,��K�Z��,500,,
