�ԍ�,��Ì���,�ی�����,�J�ݎ�,�a�@���,����,�X�֔ԍ�,���ݒn�@�@,�d�b�ԍ�,�@�@���@��,����,�S�Ó���,�v�t���f�Ó���,�����S�Ó���,���_��,�_�o��,�_�o����,�_�o������,�ċz���,�������,�ݒ���,�z���,�A�����M�[��,���E�}�`��,������,�O��,���`�O��,�`���O��,���e�O��,�]�_�o�O��,�ċz��O��,�S�����ǊO��,�����O��,�畆��A���,�畆��,��A���,���a��,����,�Y�w�l��,�Y��,�w�l��,���,���@��A��,�C�ǐH����,���n�r���e�[�V������,���ː���,������,����,��������,���򕔊O��,���Ȍ��o�O��,�a���f�f��,���ː��f�f��,���ː����É�,�ݒ�����,�ݒ��O��,�S������,�ċz�����,�z�����,���������,����������,���͓���,�l�H���͓���,�t������,�̑�����,�V�N����,��������,���t����,���A�a����,���A�a���������,���A�a�E��ӓ���,������E��ӓ���,�t������(�l�H����),����������,�y�C���N���j�b�N����,������,�y�C���N���j�b�N�O��,������O��,������O�ȁi�������j,�������O��,���B�O��,�����E���B�O��,���B�E������O��,�_�̂��O��,���O��,�t���O��,��������,�V��������,�����E�v�t����,�s�D���Õw�l��,���Y������,���t�E��ᇓ���,��ᇓ���,�Տ�������,�ɘa�P�A����,�~�}��,�b��B�O��,�ɘa�P�A�O��,���e�`���O��,�a�����v,���,�×{,���j,���_,������,�~�}�a�@�F��,�h�b�t�̗L��,�E��a�@,�ܓx,�o�x,
1,���,���]�ی���,��,���I�a�@,���쌧�������a�@,769-2702,���쌧��������s�����X�U�R,0879-25-4154,�Ⓦ�@�d�M,1,,,,,,,,,,,,,,1,1,1,,,,,1,,,,,,,,,,1,,,1,1,1,,,,,,,,,,,1,1,1,,,,,,,,,,,,,,,,,,,,,,,,,,,,,,,,,,,,,,,,150 ,150 ,,,,,1 ,,,34.241872,134.369859,
2,���,���]�ی���,�s,���I�a�@,���ʂ��s���a�@,769-2393,���쌧���ʂ��s���쒬�Γc���b�R�W�V�|�P,0879-43-2521,���c�@����,1,1,,,1,,,,,,,,,1,1,1,1,1,,1,,,,,1,1,,,1,,,1,1,,1,1,1,,,,,,,,,,,1,1,1,,,,1,,,,1,,,,1,,,,,,,,,,,,,,,,,,,,,,,,,,,,179 ,175 ,,,,4 ,1 ,,,34.267160,134.202065,
3,���,���]�ی���,��@,���I�a�@,��Ö@�l������a�@,769-2101,���쌧���ʂ��s�u�x�P�T�U�Q,087-894-5050,����@�C�g,1,1,,,1,,1,,,,,,,,,,1,,,,,,,,,1,,,,,,,,,1,1,,,,,,,,,,,,,,,,,,,,,,,,,,,,,,,,,,,,,,,,,,,,,,,,,,,,,,304 ,,304 ,,,,,,,34.320286,134.195486,
4,���,���]�ی���,��@,���I�a�@,���c�a�@,769-2601,���쌧��������s�O�{���P�V�T�W,0879-25-2673,���c�@��,1,,,,,,,,,1,,1,,1,,1,1,1,,1,,,,,1,1,,1,,,,,,,1,,,,,,,,,,,,,,,,,,,,,,,,,,,,,,,,,,,,,,,,,,,,,,,,,,,,,,,60 ,48 ,12 ,,,,1 ,,,34.248077,134.339183,
5,���,���]�ی���,��@,���I�a�@,��Ö@�l�Вc���S���{�a�@,769-2609,���쌧��������s�쓌103-1,0879-25-1121,����@�q��,1,,,,,,,,,,,,,1,,1,1,1,,1,1,,,,1,1,,,,,,,,,1,1,1,,,,,,,,,,,1,,,,,,,,,,,,,,,,,,,,1,,,1,,,,1,,,,,,,,,,,,,,,108 ,52 ,56 ,,,,1 ,,,34.249301,134.331868,
6,����,�����ی���,��,���I�a�@,�����������a�@,761-4301,���쌧�����S���������r�c2060�Ԓn1,0879-75-1121,�����@���l,1,,,,,,,,,,,,,,1,1,1,,,1,,,,,1,1,,,1,,,1,1,,1,1,,,,,,,,,,,,,,,,,1,,,,,,,,,,,,,,,,,,,,,,,,,,,,,,,,,,,,,234 ,185 ,40 ,5 ,,4 ,1 ,,,34.482392,134.234199,
7,����,�����ی���,��@,���I�a�@,��Ö@�l�Вc���������a�@,761-4301,���쌧�����S���������r�c�Q�T�P�X�|�S,0879-75-0570,���c�@��,1,1,,,1,,1,,,,,,,,,,,,,,,,,,,,,,,,,,,,1,1,,,,,,,,,,,,,,,,,,,,,,,,,,,,,,,,,,,,,,,,,,,,,,,,,,,,,,224 ,,40 ,,184 ,,,,,34.484277,134.230613,
8,����,�����ی���,��@,���I�a�@,��Ö@�l�Вc�΂����a�@,761-4411,���쌧�����S�����������c�b�R�R,0879-82-1111,����@��,1,,,,,,,,,,,,,1,,1,1,,,1,,,,,,,,,,,,,,,1,,,,,,,,,,,1,,,,,,,,,,,,,,,,,,,,,,,,,,,,,1,,,,,,,,,,,,,,,47 ,,47 ,,,,1 ,,,34.478911,134.316546,
9,����,�����s�ی���,�����J����,�����a�@,�����×{���哇����,761-0130,���쌧�����s�������U�O�R�S�|�P,087-871-3131,�V���@�p��,1,,,,,,,,,,,,,,,1,1,1,,,,,,,1,,,,,,,1,1,,,,,1,,,,,,,,,,,,,,,,,,,,,,,,,,,,,,,,,,,,,,,,,,,,,,,,,,,,133 ,133 ,,,,,,,,34.409163,134.107454,
10,����,�����s�ی���,�ƍs�@�l�����a�@�@�\,�����a�@,�Ɨ��s���@�l�����a�@�@�\ ������ÃZ���^�[,761-0103,���쌧�����s�V�c����8,087-841-2146,�א�@��,1,,,,,,1,,,,,,,,,1,1,,,,,,,,,1,,,,,,,,,1,,1,1,,,,,,,,,,1,1,1,,,,,,,,,,,,,,,,,,,,,,,,,,,,,,,,,,,,,,,,320 ,220 ,,100 ,,,1 ,,,34.320059,134.109749,
11,����,�����s�ی���,��,���I�a�@,���쌧�������a�@,760-0017,�����s�������꒚��2��1��,087-811-3333,���c�@�g�v,1,,,,,,1,,,,,,,,1,1,1,1,,1,1,1,1,,1,1,,,1,,,1,1,,1,1,1,1,,1,1,1,,,,,,1,1,1,,,,1,1,,,1,1,,,,,,,,,,,,,,1,,,,,,,,,,1,,1,,,,,531 ,526 ,,5 ,,,1 ,1,,34.348600,134.062385,
12,����,�����s�ی���,��,���I�a�@,�����푍�������ð��ݕa�@,761-8057,���쌧�����s�c����1114,087-867-6008,�؉��@��,1,,,,,,,,,,,,,,1,,1,,,1,,,,,1,1,,,,,,1,1,,1,,,1,,,,,,,,,,,1,,,,,,,,,,,,,,,,,,,,,,,,,,,,,,,,,,,,,,,,,117 ,117 ,,,,,, ,1,34.306907,134.030768,
13,����,�����s�ی���,�s,���I�a�@,�����s���a�@,760-8538,���쌧�����s�{�e��2���ڂR�U�|�P,087-834-2181,�a�c�@�叕,1,,,,1,,,,,,,,,,1,1,1,1,,1,1,,,,1,1,,,,1,1,1,1,,1,1,1,,,,,1,,,,,,1,1,1,,,,,,,,,,,,,,,,,,,,,,,,,,,,,,,,,,,,,,,,417 ,341 ,,,70 ,6 ,1 ,1,,34.336940,134.030779,
14,����,�����s�ی���,�s,���I�a�@,�����s���a�@���]���@,761-1611,���쌧�����s���]�������㓌�X�X�|�P,087-893-0031,�֊с@����,1,,,,,,,,,,,,,,,1,1,,,1,,,,,1,,,,,,,,,,1,,,1,,,,,,,,,,,,,,,,,,,,,,,,,,,,,,,,,,,,,,,,,,,,,,,,,,,,87 ,,87 ,,,,,,,34.171443,134.080368,
15,����,�����s�ی���,����,���I�a�@,�����ԏ\���a�@,760-0017,���쌧�����s�Ԓ�4���ڂP�|�R,087-831-7101,�ԒJ�@�ǈ�,,,,,1,,1,,,,,,,,1,,1,,,1,,1,1,,1,1,,,1,,,1,1,,1,1,1,,,,1,1,,,,,,1,1,1,,,,1,,,,1,,,,1,,,,,,1,,,,1,,,,1,,,,,,,,,,,,,,576 ,568 ,,8 ,,,1 ,1,,34.340746,134.043040,
16,����,�����s�ی���,�ϐ���,���I�a�@,�Љ���@�l�������c�ϐ���x�����쌧�ϐ���a�@,761-8076,���쌧�����s����㒬1331-1,087-868-1551 ,��с@�v�j,1,,,,,,,,,,,,,,1,1,1,,,,,,,,1,1,,,,,,1,,,1,1,1,,,,,,,,,,,,1,1,,,1,1,,,,,1,,,,,1,,,,1,,1,,,,,,,,,,,,,,,,,,,,198 ,148 ,50 ,,,,1 ,,,34.295546,134.058335,
17,����,�����s�ی���,�����A,���I�a�@,���������a�@,761-0113,���쌧�����s���������P�W�T�V�|�P,087-841-9141,�����@���v,1,1,,,1,,1,,,,,,1,1,1,1,1,,,1,1,1,,,1,1,,,1,,,1,1,,1,1,1,1,,,,,,,1,,,1,1,1,1,,,1,,,,,1,,,,,,,,,1,,,1,,,,1,,,,,,,,,,,,,,,310 ,310 ,,,,,1 ,,,34.340283,134.098069,
18,����,�����s�ی���,�ƍs�@�l�n���Ë@�\���i�@�\,�����a�@,�Ɨ��s���@�l�n���Ë@�\���i�@�\�@����a�@,760-0073,���쌧�����s�I�ђ�3���ڂT�|�X,087-862-3171,�O��@���u,1,,,,,,,,1,,,1,,,1,1,1,,,1,,,,,1,1,,,,,1,1,1,,1,1,1,1,,,,,,,,,,,,,,,,,,,,,,,,,,,,,,,,,,,,,,,,,,,,,,,,,,,,271 ,271 ,,,,,1 ,,,34.328690,134.050435,
19,����,�����s�ی���,���ϘA,���I�a�@,�����a�@,760-0018,���쌧�����s�V�_�O4-18,087-861-3261,����@����,1,,,,,,1,,,,,,1,1,,1,,,,1,1,,,,,1,,,,,1,1,,,1,1,1,,,,,,,,,,,1,1,1,,,,1,,,,,,1,,,,,,,,1,,,,,,,,,,,,,,,,,,,,,,179 ,179 ,,,,,1 ,,1,34.340103,134.050489,
20,����,�����s�ی���,���,���I�a�@,��ʍ��c�@�l�吼���_�q�������������吼�a�@,761-8056,���쌧�����s��V�_��336,087-865-3330,�g�c�@�䑩,,,,,1,,,,,,,,,,,,,,,,,,,,,,,,,,,,,,,,,,,,,,,,,,,,,,,,,,,,,,,,,,,,,,,,,,,,,,,,,,,,,,,,,,,,,374 ,,,,374 ,,,,,34.315487,134.044204,
21,����,�����s�ی���,���,���I�a�@,��ʍ��c�@�l�O���w�����������O�������ð��ݕa�@,760-0018,���쌧�����s�V�_�O5-5,087-831-2101,���z�@���V,1,,,,,,,,,,,,,1,,,1,,,1,,,,,,,,,,,,,,,1,1,,,,,,,,,,,,,,,,,,,,,,,,,,,,,,,,,,,,,,,,,,,,,,,,,,,,,,61 ,61 ,,,,,1 ,,,34.339949,134.045034,
22,����,�����s�ی���,��@,���I�a�@,��Ö@�l�a����O�c�a�@,761-8054,���쌧�����s��ʾޒ�824,087-865-7111,�O�c�@��F,1,,,,,,,,,,,,,,,1,1,,,,,,,,,,,,,,,,,,1,,1,,,,,,,,,,,,,1,,,,,,,,,,,,,,,,1,,1,,,,,,,1,,,,,,,,,,,,,,,96 ,36 ,60 ,,,,1 ,,,34.320493,134.038888,
23,����,�����s�ی���,��@,���I�a�@,��Ö@�l���c���m��L�i�V��ѕa�@,761-8023,���쌧�����s�S��������435�|�P,087-881-3631,�^��@���j,1,1,,,1,,1,,,,,,,,,1,1,1,,1,,,,,,1,,,,,,1,,,1,,1,,,,,,1,,,,,1,1,1,,,1,1,,,,,1,,,,,,,,,1,,,,,,,,,,,,,,,,,,1,,,,254 ,199 ,55 ,,,,1 ,,,34.332708,134.002186,
24,����,�����s�ی���,��@,���I�a�@,��Ö@�l�Вc�O�b��ؑ��O��a�@,760-0080,���쌧�����s�ؑ���8��R�W�R�U�|�V,087-867-3131,�O��ד�Y,1,,,,,,,,,,,,,,,1,1,,,,,1,,,,,,,,,,,,,1,,,,,,,,,,,,,,1,1,,,,,,,,,,,,,,,,,,1,,,,,,,1,,,,,,,,,,,,,,,31 ,31 ,,,,,1 ,,,34.321053,134.080237,
25,����,�����s�ی���,��@,���I�a�@,��Ö@�l�Вc�V�i������]�_�o�O�ȕa�@,761-8083,���쌧�����s�O����378-1,087-886-3300,����@�M�F,1,,,,,,1,,,,,,,,,1,1,,,1,,,,,,,,,,,,,,,1,1,1,,,,,,,,,,,,1,,,,,,,,,,,,,,,,,,,,,,,,,,,,,,,,,,,,,,,,,69 ,69 ,,,,,1 ,,,34.291251,134.032466,
26,����,�����s�ی���,��@,���I�a�@,��Ö@�l�Вc�S�Εa�@,761-0113,���쌧�����s���������P�X�R�V�|�P,087-843-6121,�����@�R���q,1,,,,,,,,,,,,,,,1,1,,,1,,,1,,,1,,,,,,,,,1,,1,,,,,,,,,1,,,1,,,,,,,,,,,,,,,,,,,,,,,,,,1,,,,,,,,,,,,,,,87 ,87 ,,,,,1 ,,,34.338978,134.104171,
27,����,�����s�ی���,��@,���I�a�@,��Ö@�l�h����J�a�@,760-0017,���쌧�����s�Ԓ�2���ڂP�Q�|�T,087-851-2396,����@�@��,1,,,,,,,,,,,,,,,,,,,,,,,,,,,,,,,,,,,,,,,,,,,,1,,,,,,,,,,,,,,,,,,,,,,,,,,,,,,,,,,,,,,,,,,,,,48 ,,48 ,,,,, ,,34.344304,134.040840,
28,����,�����s�ی���,��@,���I�a�@,��Ö@�l�Вc����~�^�j���c�a�@,761-0450,���쌧�����s�O�J��1680-1,087-864-8778,���c�@�r�a,1,,,,,,,,1,1,,1,,1,,1,,,,,,,,,1,1,,,,,,,,,1,1,,,,,,,,,,,,,,,,,,,,,,,,,,,,,,,,,,,,,,,,,,,,,,,,,,,,,,85 ,42 ,43 ,,,,,,,34.280364,134.060044,
29,����,�����s�ی���,��@,���I�a�@,��Ö@�l�Вc�N�������ѕa�@,760-0017,���쌧�����s�Ԓ�1���ڂP�O�|�R,087-862-1231,��с@���k,1,,,,,,,,,,,,,,,,,,,,,,,,,,,,,,,,,,1,1,,,,,,,,,,,,,1,1,,,,,,,,,,,,,,,,,,,,,,,,,,,,,,,,,,,,,,,,49 ,,49 ,,,,,,,34.342140,134.045396,
30,����,�����s�ی���,��@,���I�a�@,��Ö@�l�Вc�[�F��v�Đ�a�@,761-0102,���쌧�����s�V�c���b�S�V�S�|�R,087-844-3111,�g�V�@��,,,,,,,,,,,,,,1,,,1,,,1,1,,,,1,,,,,,,,,,1,,,,,,,,,,,,,1,1,1,,,,,,,,,1,,,,,,,,,1,,,,,1,,,,,,,,,,,,,,,,,49 ,49 ,,,,,1 ,,,34.328593,134.105523,
31,����,�����s�ی���,��@,���I�a�@,��Ö@�l�Вc�a�L��ɒB�a�@,760-0076,���쌧�����s�ό����T�W�W�|�W,087-831-1701,�ɒB�@�w,1,,,,,,,,,,,,,�@,,1,1,,,,,,,,,,,,,,,,,,1,1,,,,,,,,,,,,,,,,,,,,,,,,,,,,,,,,,,,,,,,,,,,,,,,,,,,,,,50 ,24 ,26 ,,,,1 ,,,34.334020,134.060955,
32,����,�����s�ی���,��@,���I�a�@,��Ö@�l�Вc�����L���a�@,760-0079,���쌧�����s���꒬35-3,087-867-9911,�A���@�F�F,,,,,,,,,,,,,,1,,1,1,,,,,,,,,,,,,,,,,,1,,,,,,,,,,,,,,,,,,,,,,,,,,,,,,,,,,,,,,,,,,,,,,,,,,,,,,,43 ,43 ,,,,,1 ,,,34.322396,134.064412,
33,����,�����s�ی���,��@,���I�a�@,��Ö@�l�Вc�ʑ���n��a�@,761-8031,���쌧�����s����580,087-881-4375,�n��@�_��,1,1,,,1,1,,,,,,,,,,,,,,,,,,,,,,,,,,,,,,,,1,,,,,,,,,,,,,,,,,,,,,,,,,,,,,,,,,,,,,,,,,,,,,,,,,,,,427 ,,,,427 ,,,,,34.348366,134.014840,
34,����,�����s�ی���,���̑��@�l,���I�a�@,���������a�@,760-0080,���쌧�����s�ؑ���4664,087-833-2330,�k���@�F�v,1,,,,,,,,,,,,,,,1,1,,,,,,,,,,,,,,,,,,1,,,,,,,,,,,,,,,,,,,,,,,,,,,,,,,,,,,,,,,,,,,,,,,,,,,,,,,85 ,�@,85 ,,,,,,,34.323147,134.085810,
35,����,�����s�ی���,��@,���I�a�@,��Ö@�l�Вc�Ԙa��N�����a�@,760-0047,���쌧�����s������1-4,087-851-5208,���_�@�p��,1,1,,,1,,,,,,,,,1,,,1,,,,,,,,1,1,,,,,,,,,1,1,,,,,,,,,1,,,1,1,,,,,,,,,,1,,,,,,,,,,,,,,,,,,,,,,,,,,,,,,1,73 ,73 ,,,,,1 ,,,34.344055,134.055095,
36,����,�����s�ی���,���̑��@�l,���I�a�@,�������a�a�@,760-8530,���쌧�����s�I�ђ�1���ڂS�|�P,087-833-8113,�@��@�G��,1,1,,,,,,,1,1,�@,1,1,1,1,1,1,,,,,,,,,,,,,,,,,,1,,,,,,,1,,,,,,,,,,,,,,,,,,,,,,,,,,,,,1,,,,,,,,,,,,,,1,1,,,,123 ,123 ,,,,,1 ,,,34.331443,134.046837,
37,����,�����s�ی���,��@,���I�a�@,��Ö@�l�Вc���p��ē��a�@,760-0072,���쌧�����s�ԉ���1���ڂU�|�W,087-862-3155,�ē��@���p,,,,,,,,,,,,,,1,,1,1,,,,,,,,,,,,,,,,,,1,,,,,,,,,,,,,,,,,,,,,,,,,,,,,,,,,,,,,,,,,,,,,,,,,,,,,,,43 ,,43 ,,,,1 ,,,34.335327,134.056617,
38,����,�����s�ی���,��,���I�a�@,���`�O�ȋg���a�@,760-0017,���쌧�����s�Ԓ�1����4-13,087-851-8775,�g��@����,1,,,,,,,,,,,,,1,,1,1,,,,,,,,,,,,,,,,,,1,,,,,,,,,,,,,,,1,,,,,,,,,,,,,,,,,,,,,,,,,,,,,,,,,,,,,,,,54 ,54 ,,,,,,,,34.343721,134.045434,
39,����,�����s�ی���,��@,���I�a�@,��Ö@�l�Вc�O����}�I�J�a�@,760-0052,���쌧�����s����1���ڂP�Q�|�P�S,087-862-8888,�����@�O��,1,,,,,,,,,,,,,1,,,1,,,,,,,,,,,,,,,,,,1,,1,,,,,,,,,,,,,,,,,,,,,,,,,,,,,,,,,,,,,,,,,,,,,,,,,,,,,58 ,29 ,29 ,,,,1 ,,,34.340922,134.051978,
40,����,�����s�ی���,��@,���I�a�@,��Ö@�l�Вc�Șa�M��킫�a�@,761-1402,���쌧�����s���쒬�R���P�P�R�|�P,087-879-3533,�n�Ӂ@���V,1,1,,,1,1,1,,1,1,,,,,,,,,,,,,,,,,,,,,,,,,1,,1,1,,,1,,,,,,,,,,,,,,,,,,,,,,,,,,,,,,,,,,,,,,,,,,,,,,,,,237 ,,,,237 ,,,,,34.236870,134.021796,
41,����,�����s�ی���,��@,���I�a�@,��Ö@�l�Вc������O���a�@,761-0123,���쌧�����s���璬���W�W�R�|�P,087-845-3301,�s��@���_,1,,,,1,,,,,,,,,,,,,,,,,,,,,,,,,,,,,,,,,,,,,,,,,,,,,,,,,,,,,,,,,,,,,,,,,,,,,,,,,,,,,,,,,,,,,320 ,,,,320 ,,,,,34.331413,134.151079,
42,����,�����s�ی���,��@,���I�a�@,��Ö@�l�Вc�m����I�T�J�a�@,761-1703,���쌧�����s���쒬���Q�V�Q,087-889-0703,�X��@�n��,1,,,,,,,,,,,,,,,1,1,1,,,,,,,,1,,,,,,,,,1,1,1,,,,,,,,,,,,1,,,,,,,,,,,,,,,,,,,,,,,,,,1,,,,,,,,,,,,,,,52 ,52 ,,,,,1 ,,,34.266551,134.034173,
43,����,�����s�ی���,��@,���I�a�@,��Ö@�l�Вc�L�j����a�@,769-0101,���쌧�����s���������V���T�O�O�Ԓn�P,087-874-3131,����  �q�j,1,,,,,,1,,,,,,,,,1,1,,,,,,,,,,,,,,1,1,,,1,,,,,,,,,,1,,,,1,,,,,,,,,,,,,,,,,,,,,,,,,,,,1,,,,,,,,,,,,,50 ,50 ,,,,,,,,34.291555,133.958242,
44,����,���]�ی���,������w�@�l,�����a�@,������w�@�l �����w��w�������a�@,761-0793,���쌧�ؓc�S�O�ؒ��厚�r�˂P�V�T�O�|�P,087-898-5111,�������@�T��,1,,,,1,,,,,,,,,,1,1,1,1,,1,,1,1,,1,1,,,1,,,1,1,,1,1,1,,,,1,1,,,,,,,1,,,,,,,,,,,,,,,,,,,1,,,,,,,,,,,,,,,1,,,1,,,,613 ,587 ,,,26 ,,1 ,1,,34.292527,134.123563,
45,����,���]�ی���,��@,���I�a�@,��Ö@�l�Вc�]�z�������a�@,761-0701,���쌧�ؓc�S�O�ؒ��厚�r��3232-1,087-898-0620,�����@����,1,,,,,,,,,,,,,,1,,1,,,,,,,,,,,,,,,,,,1,,,,,,,,,,,,,,1,1,,,,,,,,,,,,,,,,,,,,,,,,,,,,,,,,,,,,,,,,42 ,42 ,,,,,1 ,,,34.274712,134.120983,
46,����,���]�ی���,��@,���I�a�@,��Ö@�l�t����~���a�@,761-0702,���쌧�ؓc�S�O�ؒ����؂T�U�|�V,087-898-1431,�~���@�d��,1,,,,,,,,,,,,,,,1,1,,,,,,,,1,1,,,,,,,,,1,,1,,,,,,,,,,,,,,,,,,,,,,,,,,,,,,,,,,,,,,1,,,,,,,,,,,,,,,37 ,37 ,,,,,1 ,,,34.270971,134.128635,
47,���],���]�ی���,�ƍs�@�l�J���Ҍ��N���S�@�\,�����a�@,�Ɨ��s���@�l�J���Ҍ��N���S�@�\ ����J�Еa�@,763-8502,���쌧�ۋT�s�铌��3���ڂR�|�P,0877-23-3111,���c�@�T��,1,,,,1,,1,,,,,,,,,1,1,1,,1,,,,,,1,,,1,,,1,1,,1,1,1,,,,1,1,1,1,,,,,1,,,,,,,,,,,,,,,,,,,1,,,,,,,,,,,,,,,,,,,,,,404 ,404 ,,,,,1 ,1,1,34.288130,133.805878,
48,���],���]�ی���,��,���I�a�@,���쌧���ۋT�a�@,763-8518,���쌧�ۋT�s�y�풬��9���ڂQ�X�P,0877-22-2131,���y�S�T�S,1,1,1,,1,,,,,,,,,,,,,,,,,,,,,,,,,,,,,,1,,,1,,,,,,,,,,,,,,,,,,,,,,,,,,,,,,,,,,,,,,,,,,,,,,,,,,,,215 ,,,,215 ,,,,,34.300941,133.808344,
49,���],���]�ی���,��@,���I�a�@,���c�����a�@,763-0052,���쌧�ۋT�s�ÐX��219,0877-23-5555,�؁@�L�O,1,1,,,1,,1,1,,,,,,,,1,1,1,1,1,1,,,,1,1,,,,,,1,1,,1,1,1,,,,,,,,,,,1,1,1,,,,,,,,,1,,,,,,,,,1,,,,,,,,,,,,,,,,,,,,,,300 ,300 ,,,,,1 ,,,34.276834,134.794859,
50,���],���]�ی���,��@,���I�a�@,��Ö@�l�Вc������R�a�@,763-0032,���쌧�ۋT�s�鐼��2���ڂP�|�R,0877-23-0231,�􌴁@��O,1,,,,,,,,1,,1,,,1,,1,1,,,,,,,,1,,1,,,,,,,,1,1,,,,,,,,,,,,,,,,,,,,,,,,,,,,,,,,,,,,,,,,,,,,,,,,,,,,,,54 ,,54 ,,,,,,,34.282802,133.796599,
51,���],���]�ی���,��@,���I�a�@,��Ö@�l�Вc�O����O�D�a�@,763-0073,���쌧�ۋT�s�o����366,0877-23-2341,�O�D�@�a�j,1,1,,,1,,,,,,,,,,,,,,,,,,,,,,,,,,,,,,,,,1,,,,,,,,,,,,,,,,,,,,,,,,,,,,,,,,,,,,,,,,,,,,,,,,,,,,406 ,,,,406 ,,,,,34.267288,133.803646,
52,���],���]�ی���,��@,���I�a�@,��Ö@�l�m����g�c�a�@,763-0007,���쌧�ۋT�s�@�Ò�5,0877-22-8101,�g�c�@���m�q,1,,,,,,,,,,,,,,,,1,,,1,,,,,,,,,,,,,,,1,,,,,,,,,,1,,,,1,,,,,,,,,,,,,,,,,,,,,,,,,,,,,,,,,,,,,,,,,62 ,,62 ,,,,,,,34.292554,133.796588,
53,���],���]�ی���,��@,���I�a�@,��Ö@�l�Вc�O�a��������a�@,764-0021,���쌧�����x�S���x�Ò��x�]�S���ڂR�|�P�X,0877-33-2545,�O�c�@����,1,1,,,1,,1,,,,,,,,,,,,,,,,,,,,,,,,,,,,,,,,,,,,,,,,,,,,,,,,,,,,,,,,,,,,,,,,,,,,,,,,,,,,,,,,,,,186 ,,,,186 ,,,,,34.280560,133.760854,
54,���],���]�ی���,��@,���I�a�@,��Ö@�l�Вc�Ђ����͓��a�@,764-0033,���쌧�����x�S���x�Ò��厚�؂P�R�O�|�P,0877-33-3113,�͓��@���j,1,,,,,,,,1,,,1,1,,1,,,,,,,,,,,,,,,,,,,,1,1,,,,,,,,,1,,,,,,1,,1,1,1,1,,,1,,,,,,,,,,,,,,,,,,,,,,,,,,,,,,,60 ,,60 ,,,,,,,34.252975,133.752213,
55,���],���]�ی���,��@,���I�a�@,��Ö@�l�Вc���a���a�@,763-0052,���쌧�ۋT�s�ÐX��595,0877-22-5205,����@�F��,,1,,,1,,1,,,,,,,,,,,,,,,,,,,,,,,,,,,,,,,,,,,,,,,,,,,,,,,,,,,,,,,,,,,,,,,,,,,,,,,,,,,,,,,,,,,130 ,,,,130 ,,,,,34.281010,133.790023,
56,���],���]�ی���,��@,���I�a�@,��Ö@�l�Вc�X�V��ۋT�ѕa�@,763-0001,���쌧�ۋT�s���ܒ�177-1,0877-22-8181,�с@���m�q,1,,,,,,,,,,,,,,,,,,,,,,,,,,,,,,,,,,1,1,,,,,,,,,,,,,,,,,,,,,,,,,,,,,,,,,,,,,,,,,,,,,,,,,,,,,,48 ,,48 ,,,,,,,34.292071,133.800320,
57,���],���]�ی���,��@,���I�a�@,��Ö@�l�Вc���m���{�a�@,763-0093,���쌧�ۋT�s�S�ƒ�2486-5,0877-28-6311,��{�@���m,1,,,,,,,,,,,,,1,,1,1,,,,,,,,,,,,,,,,,,1,,,,,,,,,,,,,,1,1,,,,,,,,,1,,,,,,,,,,,,,,,,,,,,,,,,,,,,,,,73 ,,73 ,,,,,,,34.256523,133.800310,
58,���],���]�ی���,��@,���I�a�@,��Ö@�l�Вc���m����m�a�@,763-0043,���쌧�ۋT�s�ʒ�133,0877-23-2311,���R�@�B�F,1,,,,,,,,,,,,,,,,,,,,,,,,,,,,1,,,,,,1,,,,,,,,,,,,,,,,,,,,,,,,,,,,,,,,,,,,,,,,,,,,,,,,,,,,,,,66 ,42 ,24 ,,,,,,,34.291609,133.796748,
59,���],���]�ی���,��@,���I�a�@,��Ö@�l�Вc�݂ǂ������a�@,764-0025,���쌧�����x�S���x�Ò������V�|�R,0877-33-2821,�����@�N�m,1,,,,,,,,,,1,1,,,,,1,,,,,,,,,,,,,,1,,,,1,1,,,,,,,,,,,,,,,,,,,,,,,,,,,,,,,,,,,,,,,,,,,,,,,,,,,,,,43 ,,43 ,,,,,,,34.270047,133.758583,
60,���],���]�ی���,��,���I�a�@,���x�ÎO��a�@,764-0011,���쌧�����x�S���x�Ò��h���Q���ڂP�|�R�U,0877-32-2447,�O��@��,,,,,,,,,,,,,,,,1,1,,,,,,,,,,,,,,,,,,1,,,,,,,,,,1,,,,,,,,,,,,,,,,,,,,,,,,,,1,,,,1,,,,,,,,,,,,1,,,29 ,29 ,,,,,,,,34.272856,133.756695,
61,���],���]�ی���,��@,���I�a�@,��Ö@�l�Вc��R����L�O�a�@,763-0033,���쌧�ۋT�s���{��5���ڂP�Q�|�P�P,0877-23-2205,�c���@��,1,,,,,,,,,,,,,,,,,,,,,,,,,,,,,,,,,,,,,,,,,,,,,,,,1,1,,,,,,,,,,,,,,,,,,,,,,,,,,,,,,,,,,,,,,,,153 ,30 ,123 ,,,,,,,34.286023,133.792606,
62,���],���]�ی���,��@,���I�a�@,��Ö@�l�Вc����݂�̉�{��a�@,763-0033,���쌧�ۋT�s���{��4���ڂP�R�|�Q�W,0877-22-3171,�{��@����,1,,,,,,,,,,,,,,,,,,,,,,,,,,,,,,,,,,1,,,,,,,,,,1,,1,1,,,1,1,,1,,,1,,,,,,,,,,,,,,,,,,,,,,,,,,,,,,,,,81 ,30 ,51 ,,,,,,,34.286445,133.790912,
63,���],���]�ی���,�s,���I�a�@,��o�s���a�@,762-0043,���쌧��o�s�撬�R���ڂP�|�Q,0877-46-5131,����@���F,1,,,,,,,,,,,,,1,1,1,1,,,1,1,,,,,1,,,1,,,1,1,,1,1,1,,,,,,,,,,,1,1,1,,,,1,,,1,1,1,,,,,,,,,1,,,,,,,,,,,,,,,,1,,,,,,194 ,194 ,,,,,1 ,,,34.317083,133.849634,
64,���],���]�ی���,��@,���I�a�@,�Љ��Ö@�l���c�������a�@�񐶕a�@,762-0007,���쌧��o�s����3����5-28,0877-46-1011,����@����,1,1,,,1,1,1,,,1,,1,,1,1,1,1,1,,1,1,,,,,1,1,1,1,,,1,1,1,1,1,1,,,,,1,,,,,,1,,,,,,,,,,1,,,,,,,1,,,,,,,,,,,,,,,,,,,1,,1,,,,402 ,351 ,,,51 ,,1 ,1,,34.317829,133.861651,
65,���],���]�ی���,��@,���I�a�@,��Ö@�l�Вc�ܐF��ܐF��a�@,762-0023,���쌧��o�s���Β�963,0877-48-2700,�����@�m,1,1,,,1,,,,,,,,,,,,,,,,,,,,,,,,,,,,,,,,,1,,,,,,,,,,,,,,,,,,,,,,,,,,,,,,,,,,,,,,,,,,,,,,,,,,,,280 ,,,,280 ,,,,,34.310552,133.912322,
66,���],���]�ی���,��@,���I�a�@,��Ö@�l�Вc�ԐS��ԑ�a�@,762-0024,���쌧��o�s�{����325,0877-48-3200,���V�@���q,1,,,,1,1,1,,,,,,,,1,,,,,,,,,,,,,,,,,,,,,,,,,,,,,,,,,,,,,,,,,,,,,,,,,,,,,,,,,,,,,,,,,,,,,,,,,,,194 ,21 ,21 ,,152 ,,1 ,,,34.294712,133.936607,
67,���],���]�ی���,���̑��@�l,���I�a�@,��o���}���`���a�@,762-0033,���쌧��o�s�J��1����4-13,0877-46-5195,���s�@��,1,,,,,,1,,1,1,,1,,,1,1,1,,,,,,,,,1,,,,,,1,,,1,1,1,,,,,,,,,,,,,,,,,,,,,,,,,,,,,,,,,,,,,,,,,,,,,,,,1,,,1,,196 ,156 ,40 ,,,,1 ,,,34.311802,133.859785,
68,���],���]�ی���,��@,���I�a�@,��Ö@�l�Вc���R�]�_�o�O�ȕa�@,762-0023,���쌧��o�s���Β��T�X�R�Ԓn�P,0877-48-3366,���R�@���u,1,,,,,,,,,,,,,,,1,1,1,,1,,,,,1,,,,,,,1,1,,1,,,,,,,,,,,,,,1,,,,,,,,,,,,,,,,,,,,,,,,,,,,,,,,,,,,,,,,,41 ,41 ,,,,,1 ,,,34.307031,133.909894,
69,���],���]�ی���,�ƍs�@�l�����a�@�@�\,�����a�@,�Ɨ��s���@�l�����a�@�@�\ �l�����ǂ��Ƃ��ƂȂ̈�ÃZ���^�[,765-0001,���쌧�P�ʎ��s��V��2���ڂP�|�P,0877-62-1000,����@�`�M,1,1,,,1,1,,,,,,,,1,1,1,1,1,,1,1,1,1,,1,1,,,,1,1,1,1,,1,1,1,,,,,1,,,,,,1,1,1,,,,,,,,,,,,,,,,,,,,,1,,,,,,,,,,,,,1,,,,,,689 ,667 ,,,22 ,,1 ,1,�@,34.228629,133.772794,
70,���],���]�ی���,��,���I�a�@,���쒬�������N�ی����a�@,761-2103,���쌧���̌S���쒬��1720-1,087-876-1185,�匴�@����,1,,,,,,,,,,,,,,1,,,,,,,,,,1,1,,,,,,,1,�@,1,,,,,,,,,,,,,1,1,1,,,,,,1,,,,,,,,,,,,,,,,,,,,,,,,,,,,,,,,,,63 ,35 ,28 ,,,,,,,34.259189,133.943778,
71,���],���]�ی���,�����A,���I�a�@,���쌧�����_�Ƌ����g���A�����{�����a�@,761-2305,���쌧���̌S���쒬��{�S�W�U,087-876-1145,��z�@�S��,1,1,,,1,,,,,,,,1,1,1,1,1,1,,1,1,1,,,1,1,,,1,,,1,1,,1,,1,1,,,,,1,1,,,,1,1,1,,,,,,,,,,,,,,,,,,1,,,1,,,,,,,,,,,,,,,,,,,191 ,191 ,,,,,1 ,,,34.248293,133.924083,
72,���],���]�ی���,��@,���I�a�@,��Ö@�l�Вc��������⍲�a�@,766-0004,���쌧�����x�S�Օ����|��V�V�T,0877-73-3535,�⍲�@����,1,,,,,,,,,,,,,,,1,1,,,1,,,,,1,1,,,,,,,,,1,1,,,,,,,,,,,,1,,1,,,,,,,,,1,,,,,,,,1,1,,,1,,,1,1,,,,,,,,,,,,,,,63 ,29 ,34 ,,,,1 ,,,34.191290,133.824530,
73,���],���]�ی���,��@,���I�a�@,��Ö@�l�\�ǉ�i���a�@,769-0311,���쌧�����x�S�܂�̂������c�Q�Q�P�|�R,0877-73-3300,�X  �ɒÎq,1,,,,1,,,,,,,,,1,,,1,,,1,1,,,,1,1,,,,,,,,,1,,,,,,,,1,,,,,1,1,1,,,,,,,,,,,1,,1,,,,,,1,,,,,,,,,,,,,,,,,,,,,130 ,40 ,90 ,,,,1 ,,,34.172255,133.827468,
74,���],���]�ی���,��@,���I�a�@,��Ö@�l�Вc�c������ɂ��a�@,766-0002,���쌧�����x�S�Օ���350-10,0877-75-5101,�吼�@�m��,1,1,,,1,,,,,,,,,1,,,1,,,,,,,,1,1,,,,1,1,,,,1,1,,,,,,,,,,,,1,1,,,,,,,,,,,,,,,,,,,,,,,,,,,,,,,,,,,,,,,,,124 ,24 ,100 ,,,,,,,34.192776,133.819252,
75,���],���]�ی���,��@,���I�a�@,��Ö@�l�Вc���S��P�ʎ��O�c�a�@,765-0073,���쌧�P�ʎ��s������894-1,0877-63-3131,�O�c�@���j,1,,,,,,,,,,,,1,,1,,,,,,,,,,1,,,,,,,,,,1,1,,,,,,,,,,,,1,1,1,,,1,,,,,,1,,,,,,,,,,,,,,,,,,,,,,,,,,,,,,,46 ,46 ,,,,,,,,34.243126,133.764945,
76,���],���]�ی���,��@,���I�a�@,��Ö@�l�Вc�^�O��J�a�@,765-0032,���쌧�P�ʎ��s���c�������܏��P�P�X�O�Ԓn�P,0877-63-5800,�J�@����,,,,,,,,,,,,,,,,,,,,,,,,,,,,,,1,1,,,,,,,,,,,,,,,,,,,,,,,,,,,,,,,,,,,,,,,,,,,,,,,,,,,,,,,,,,,43 ,43 ,,,,,,,,34.250008,133.786917,
77,���],���]�ی���,��@,���I�a�@,��Ö@�l�Вc���m��F���Õa�@,769-0205,���쌧���̌S�F���Ò��l�ܔԒ�66-1,0877-56-7777,�����@���V,1,1,,,,,,,,,,,,1,,1,1,,,,,,,,,,,,,,,,,,1,,,,,,,,,,,,,,,,,,,,,,,,,,,,,,,,,,,,,,,,,,,,,,,,,,,,,,,38 ,38 ,,,,,,,,34.304200,133.810686,
78,�O�L,���]�ی���,�s,���I�a�@,�O�L�s��������a�@,767-0003,���쌧�O�L�s��������n��2986-3,0875-72-5121,��ˁ@�q��,1,,,,1,,,,,,,,,,,,,,,,,,,,,,,,,,,,,,1,,,,,,,,,,,,,,,,,,,,,,,,,,,,,,,,,,,,,,,,,,,,,,,,,,,,,,,150 ,,90 ,,60 ,,,,,34.174482,133.702254,
79,�O�L,���]�ی���,�s,���I�a�@,�O�L�s���i�N�a�@,769-1101,���쌧�O�L�s�l�Ԓ��l��1298-2,0875-83-3001,�����@�~��,1,1,,,1,1,,,,,,,,,,1,1,,,,,,,,,1,,,,,,1,1,,1,,,,,,,,,,,,,,,,,,,,,,,,,,,,,,,,,,,,,,,,,,,,,,,,,,,,,,,199 ,92 ,48 ,,59 ,,1 ,,,34.218598,133.672170,
80,�O�L,���]�ی���,�s,���I�a�@,�O�L�����a�@,769-1695,���쌧�ω����s�L�l���P�l708,0875-52-3366,�����@����,1,1,,,1,,1,,1,1,,1,,1,1,1,1,1,,1,,1,,,1,1,,,1,,,1,1,,1,,1,1,1,1,1,1,1,1,,,,,,,,,,,,,,,,,,,,,,,,,,,,,,,,,,,,,,,,,,,,,,482 ,478 ,,,,4 ,1 ,1,,34.082088,133.642090,
81,�O�L,���]�ی���,��@,���I�a�@,��Ö@�l�Вc������͓c�a�@,768-0060,���쌧�ω����s�Ζؒ��ܒ���5��32��,0875-25-3668,�͓c�@����,1,,,,,,,,,1,,,,,,1,,,,,,,,,,,,1,,,,,,,1,,1,,,,,,,,,,,,,,,,,,,,,,,,,,,,,,,,,,,,,,,,,,,,,,,,,,,,,57 ,,57 ,,,,,,,34.133829,133.661371,
82,�O�L,���]�ی���,��@,���I�a�@,��Ö@�l���a����a�@,768-0040,���쌧�ω����s�o�c���b1425-1,0875-25-3749,�ҁ@���O,,,,,1,1,,,,,,,,,,,,,,,,,,,,,,,,,,,,,,,,1,,,,,,,,,,,,,,,,,,,,,,,,,,,,,,,,,,,,,,,,,,,,,,,,,,,,161 ,,,,161 ,,,,,34.113461,133.662267,
83,�O�L,���]�ی���,��@,���I�a�@,��Ö@�l�Вc������H��a�@,768-0060,���쌧�ω����s�h���R���ڂS�|�P,0875-25-3382,�H��@�G��,1,,,,,,,,,,,,,1,,1,1,,,1,,,,,1,,,,,,,,,,1,1,,,,,,,,,,,,,,,,,,,,,,,,,,,,,,,,,,,,,,,,,,,,,,,,,,,,,,100 ,40 ,60 ,,,,1 ,,,34.124668,133.653490,
84,�O�L,���]�ی���,��@,���I�a�@,��Ö@�l�u���[�X�J�C����a�@,768-0013,���쌧�ω����s������739,0875-23-2111,���@�G��,1,1,,,,,1,,,1,,1,1,1,1,1,1,,,1,1,,,,,1,,,,,1,1,1,,1,1,,,,,,,,,,,,,,,,,,,,,,,,,,,,,,,,,,,,,,,,,,,,,,,,,,,,,,253 ,115 ,138 ,,,,1 ,,,34.133931,133.666933,
85,�O�L,���]�ی���,��@,���I�a�@,��Ö@�l�����Д���a�@,767-0001,���쌧�O�L�s�������㍂��1339,0875-72-3131,�F��@�q�F,,,,,,,,,,,,,,,,,,,,,,,,,,,,,,,,1,,,,,,,,,,,,,,,,,,,,,,,,,,,,,,,,,,,,,,,,,,,,,,,,,,,,,,,,,,40 ,40 ,,,,,,,,34.187768,133.717710,
86,�O�L,���]�ی���,��@,���I�a�@,��Ö@�l�Вc�V�h��א�a�@,769-1102,���쌧�O�L�s�l�Ԓ�����1639-1,0875-83-2211,����@�ÍG,1,,,,,,,,,1,,,,,,1,1,,,,,,,,,,,,,,1,,,,1,,1,,,,,,,,,,,,,,,,,,,,,,,,,,,,,,,,,,,,,,,,,,,,,,,,,,,,,38 ,,38 ,,,,,,,34.221752,133.691620,
87,�O�L,���]�ی���,��@,���I�a�@,��Ö@�l�Вc���L����a�@,769-1102,���쌧�O�L�s�l�Ԓ�����Q�V�W�O�|�S�Q�U,0875-83-6011,���@�׌�,1,,,,,,,,1,,1,1,,,,1,1,,,,,,,,,1,,,,,,,,,1,1,,,,,,,,,,,,,,,,,,,,,,,,,,,,,,,,,,,,,,,,,,,,,,,,,,,,,,108 ,60 ,48 ,,,,1 ,,,34.220318,133.690120,
88,�O�L,���]�ی���,��@,���I�a�@,��Ö@�l�Вc�a����{�a�@,768-0103,���쌧�O�L�s�R�{�����c���X�O�Q�|�P,0875-63-3311,�،��j,1,1,,,1,,,,,,,,,1,,1,1,,,,,,,,,1,,,,,,,,,1,1,,,,,,,,,,,,,,,,,,,,,,,,,,,,,,,,,,,,,,,,,,,,,,,,,,,,,,156 ,29 ,60 ,,67 ,,,,,34.117282,133.735753,
89,�O�L,���]�ی���,��@,���I�a�@,��Ö@�l�Вc�L����䉺�a�@,769-1613,���쌧�ω����s��쌴���Ԉ�W�P�W�Ԓn�P,0875-52-2215,�i�����v,1,,,,,,1,,,,,,,1,1,1,1,,,,,,,,1,1,,,1,,,1,1,,1,1,1,1,,,1,,,,,,,1,1,1,,,,,,,,,,,,,,,,,,,,,,,,,1,,,,,,,,,,,,,,,243 ,143 ,100 ,,,,1 ,,,34.097135,133.646594,
90,�O�L,���]�ی���,��,���I�a�@,�X�쐮�`�O�ȕa�@,767-0011,���쌧�O�L�s�����������ԂP�U�Q�R�|�P,0875-72-5661,�X��@����,1,,,,,,,,,,,1,,1,,1,1,,,,,,,,,,,,,,,,,,1,,,,,,,,,,,,,,,,,,,,,,,,,,,,,,,,,,,,,,,,,,,,,,,,,,,,,,,41 ,41 ,,,,,1 ,,,34.177816,133.717116,
,,,,,,,,,,,,,,,,,,,,,,,,,,,,,,,,,,,,,,,,,,,,,,,,,,,,,,,,,,,,,,,,,,,,,,,,,,,,,,,,,,,,,,,,,,,,,,,,,,,,,,,,,,,,,,