�s���{���R�[�h���͎s�撬���R�[�h,NO,�s���{����,�s�撬����,����,����_�J�i,����_�ʏ�,����_�p��,����������,���,�ꏊ����,�Z��,����,�ܓx,�o�x,�d�b�ԍ�,�����ԍ�,�����i���j,�����i�P�ʁj,�@�l�ԍ�,���L�ғ�,�������w���,���p�\�j��,�J�n����,�I������,���p�\�������L����,�摜,�摜_���C�Z���X,�T�v,�T�v_�p��,����,����_�p��,URL,���l
32158,1,��茧,���B�s,���㓡�ƏZ��,�L���E�S�g�E�P�W���E�^�N,,,�d�v������,������,,��茧���B�s�]�h��J�������R1,,39.192029,141.185543,0197-35-2111,,1,��,,���B�s,1965/5/29,,,,,,,,,,,,
32158,2,��茧,���B�s,���@���{���E�ɗ��E�y�啍���O���꓏�E�q�a�䌚�֌䕁���n�G�}�������`�d�l���嚤���,�V���E�{�E�W�z���h�E�E�N���E�\�E�����c�P�^���V���E���E�h�E�C�b�g�E�E�L���N�f���I�^�e�J�G�S�t�V���`�G�Y�i���r�j�R�q�i�K�^�V���E�V���_�C�Y�C�b�c�E,,,�d�v������,������,,��茧���B�s���򍕐Β������@��129,,39.068136,141.224939,0197-35-2111,,4,��,,���@��,1990/9/11,,,,,,,,,,,,
32158,3,��茧,���B�s,�����_�Ж{�a,�q�^�J�W���W���z���f��,,,�d�v������,������,,��茧���B�s����������H14,,39.142806,141.132348,0197-35-2111,,1,��,,�����_��,1990/9/11,,,,,,,,,,,,
32158,4,��茧,���B�s,�������ƏZ��,�L���E�^�J�n�V�P�W���E�^�N,,,�d�v������,������,,��茧���B�s����唨���H6,,39.141487,141.139627,0197-35-2111,,7,��,,���B�s,2011/6/20,,,,,,,,,,,,
32158,5,��茧,���B�s,���R�_�Ёi�c��Ɂj,�~�Y���}�W���W���i�\���C�V���j,,,���w��L�`������,������,,��茧���B�s����������H14,,39.142725,141.132148,0197-35-2111,,1,��,,�����_��,1972/10/27,,,,,,,,,,,,
32158,6,��茧,���B�s,��t�ƏZ���,�`�o�P�W���E�^�N����,,,���w��L�`������,������,,��茧���B�s���򍕐Β�������,,,,0197-35-2111,,1,��,,�l,1972/10/27,,,,,,,,,,,,
32158,7,��茧,���B�s,���ƏZ��i�㓡�V������j,�u�P�W���E�^�N(�S�g�E�V���y�C�L���E�^�N),,,���w��L�`������,������,,��茧���B�s����g���H8-1,,39.143604,141.138434,0197-35-2111,,1,��,,���B�s,1972/10/27,,,,,,,,,,,,
32158,8,��茧,���B�s,����J�������a�@,�L���E�C�����h�E�L���E���c�r���E�C��,,,���w��L�`������,������,,��茧���B�s�]�h�쒬4-8,,39.190627,141.181347,0197-35-2111,,1,��,,���B�s,1979/2/27,,,,,,,,,,,,
32158,9,��茧,���B�s,���㓡�����Y�ƏZ��,�L���E�S�g�E�V���E�W���E�P�W���E�^�N,,,���w��L�`������,������,,��茧���B�s�O�򐶕ꎚ�V��52,,39.068078,141.186649,0197-35-2111,,1,��,,���B�s,1985/5/4,,,,,,,,,,,,
32158,10,��茧,���B�s,�[�R�_�Ж{�a�@�����D,�n���}�W���W���z���f���@�c�P�^�����i�t�_,,,���w��L�`������,������,,��茧���B�s�]�h�ė�������199-2,,39.238189,141.338331,0197-35-2111,,1,��,,�[�R�_��,1991/3/29,,,,,,,,,,,,���D�͍]�h���y�����قɏ���
32158,11,��茧,���B�s,�q�������哰�@�����D,�`�t�N�r�V�������h�E�@�c�P�^�����i�t�_,,,���w��L�`������,������,,��茧���B�s�]�h�������q��39,,39.191949,141.266368,0197-35-2111,,1,��,,���q�������_��,1991/3/29,,,,,,,,,,,,
32158,12,��茧,���B�s,�����_�Ж{�a�@�����D,�n�`�}���W���W���z���f���@�c�P�^�����i�t�_,,,���w��L�`������,������,,��茧���B�s�_�򏬎R��������69,,39.084313,141.083665,0197-35-2111,,1,��,,�����_��,1991/3/29,,,,,,,,,,,,
32158,13,��茧,���B�s,���C�y�u�_���_�А~�q�i���ɒB�@�͗�_�~�q�j,�I���w�V�C�T���K���W���W���Y�V�i�L���E�_�e���l�A�L�����C�r���E�Y�V�j,,,���w��L�`������,������,,��茧���B�s�_������������48,,39.129969,141.030419,0197-35-2111,,1,��,,���C�y�u�_���_��,1991/3/29,,,,,,,,,,,,
32158,14,��茧,���B�s,��{���ω���,�Z�����E�W�J���m���h�E,,,���w��L�`������,������,,��茧���B�s����H�c�����剺80,,39.122293,141.209469,0197-35-2111,,1,��,,��{��,1993/9/7,,,,,,,,,,,,
32158,15,��茧,���B�s,���c�ƏZ��i���K�@�j�剮�y�т��̒�A�y���A�\��A�O���~�A������тɐ����̕�,�I�I�^�P�W���E�^�N�i�_�C�R�E�e�C�j�V�����I���r�\�m�j���A�h�]�E�A�I���e�����A�}�G�U�V�L�A�^�L�o�i���r�j�j�V�K���m�w�C,,,���w��L�`������,������,,��茧���B�s�O�򎚎�����,,,,0197-35-2111,,,,,�l,1997/9/2,,,,,,,,,,,,
32158,16,��茧,���B�s,���@���J�R���E������,�V���E�{�E�W�J�C�U���h�E�E�R�z�E�W���E,,,�s�w��L�`������,������,,��茧���B�s���򍕐Β������@��129,,39.068136,141.224939,0197-35-2111,,2,��,,���@��,1985/10/16,,,,,,,,,,,,
32158,17,��茧,���B�s,���_�Ж{�a,�J�}�h�W���W���z���f��,,,�s�w��L�`������,������,,��茧���B�s�O��Ï鎚�k���厛1,,39.067587,141.12965,0197-35-2111,,1,��,,�l,1986/7/1,,,,,,,,,,,,
32158,18,��茧,���B�s,�����c�ƏZ��剮�y�і�,�L���E�E�`�_�P�W���E�^�N�V�����I���r����,,,�s�w��L�`������,������,,��茧���B�s����g���H43,,39.142922,141.138991,0197-35-2111,,2,��,,���B�s,1990/3/31,,,,,,,,,,,,
32158,19,��茧,���B�s,����{�����{�{�a�E�q�a,�`���W���t�n�`�}���O�E�z���f���E�n�C�f��,,,�s�w��L�`������,������,,��茧���B�s���򍲑q�͎��{�m��12,,39.184483,141.137243,0197-35-2111,,2,��,,����{�����{,1992/3/31,,,,,,,,,,,,
32158,20,��茧,���B�s,���P��,�i�J�[���O��,,,�s�w��L�`������,������,�e�c��v�L�O��,��茧���B�s�]�h��ʂ�3-1,,39.190397,141.177009,0197-35-2111,,2,��,,�l,2001/5/7,,,,,,,,,,,,
32158,21,��茧,���B�s,���{���F�J�R����摜,�P���|���`���N�V���N�J�C�U�������E�V���E�K�]�E,,,���w��L�`������,���p�H�|�i,���@��,��茧���B�s���򍕐Β������@��129,,39.068136,141.224939,0197-35-2111,,1,��,,���@��,1959/3/17,,,,,,,,,,,,
32158,22,��茧,���B�s,���{���F�\�Z������,�P���|���`���N�V���N�W���E���N���J���]�E,,,���w��L�`������,���p�H�|�i,���@��,��茧���B�s���򍕐Β������@��129,,39.068136,141.224939,0197-35-2111,,16,��,,���@��,1985/9/17,,,,,,,,,,,,
32158,23,��茧,���B�s,���ω���F�摜,�V���E�J���m���{�T�c�K�]�E,,,���w��L�`������,���p�H�|�i,,��茧���B�s�]�h�Ɏ莚�䓰,,,,0197-35-2111,,1,�_,,�l,1991/8/27,,,,,,,,,,,,
32158,24,��茧,���B�s,���{�|�V�}�n�G,�P���|���^�P�m�Y�X�~�G,,,�s�w��L�`������,���p�H�|�i,���B�s���̔�����,��茧���B�s�O�򎚓�w��103-1,,39.027032,141.123985,0197-35-2111,,1,��,,���B�s,1994/6/1,,,,,,,,,,,,
32158,25,��茧,���B�s,���{��V�}�n�G,�P���|���^�J�m�Y�X�~�G,,,�s�w��L�`������,���p�H�|�i,���B�s���̔�����,��茧���B�s�O�򎚓�w��103-1,,39.027032,141.123985,0197-35-2111,,1,��,,���B�s,1994/6/1,,,,,,,,,,,,
32158,26,��茧,���B�s,�ؑ���t�@������,���N�]�E���N�V�j�����C�U�]�E,,,�d�v������,���p�H�|�i,���Ύ�,��茧���B�s���򍕐Β����R��17,,39.084318,141.20659,0197-35-2111,,1,��,,���Ύ�,1957/2/19,,,,,,,,,,,,
32158,27,��茧,���B�s,�ؑ��m�`����,���N�]�E�\�E�M���E�U�]�E,,,�d�v������,���p�H�|�i,���Ύ�,��茧���B�s���򍕐Β����R��17,,39.084318,141.20659,0197-35-2111,,1,��,,���Ύ�,1959/12/18,,,,,,,,,,,,
32158,28,��茧,���B�s,�ؑ����������V����,���N�]�E�g�o�c�r�V�������e�������E�]�E,,,�d�v������,���p�H�|�i,���q�������_��,��茧���B�s�]�h�������q��39,,39.191949,141.266368,0197-35-2111,,1,��,,���q�������_��,1959/12/18,,,,,,,,,,,,
32158,29,��茧,���B�s,�ؑ��l�V������,���N�]�E�V�e���m�E�����E�]�E,,,�d�v������,���p�H�|�i,���Ύ�,��茧���B�s���򍕐Β����R��17,,39.084318,141.20659,0197-35-2111,,4,��,,���Ύ�,1997/6/30,,,,,,,,,,,,
32158,30,��茧,���B�s,�ؑ��@�ӗ֊ω�����,���N�]�E�j���C�����J���m���U�]�E,,,���w��L�`������,���p�H�|�i,���@��,��茧���B�s���򍕐Β������@��129,,39.068136,141.224939,0197-35-2111,,1,��,,���@��,1954/4/5,,,,,,,,,,,,
32158,31,��茧,���B�s,�ؑ��m�`����,���N�]�E�\�E�M���E�U�]�E,,,���w��L�`������,���p�H�|�i,���@��,��茧���B�s���򍕐Β������@��129,,39.068136,141.224939,0197-35-2111,,3,��,,���@��,1954/4/5,,,,,,,,,,,,
32158,32,��茧,���B�s,��������ɔ@������,�h�E�]�E�A�~�_�j�����C�����E�]�E,,,���w��L�`������,���p�H�|�i,���⎛,��茧���B�s�]�h�쌴��8-6,,39.187585,141.180995,0197-35-2111,,1,��,,���⎛,1958/5/16,,,,,,,,,,,,
32158,33,��茧,���B�s,�ؑ��\��ʊω������@�O,���N�]�E�W���E�C�`�����J���m�������E�]�E�@�z�J,,,���w��L�`������,���p�H�|�i,���q�������_��,��茧���B�s�]�h�������q��39,,39.191949,141.266368,0197-35-2111,,4,��,,���q�������_��,1963/12/24,,,,,,,,,,,,
32158,34,��茧,���B�s,�ؑ���t�@������,���N�]�E���N�V�j�����C�U�]�E,,,���w��L�`������,���p�H�|�i,,��茧���B�s�ߐ�㎛�c,,,,0197-35-2111,,1,��,,�l,1969/6/6,,,,,,,,,,,,
32158,35,��茧,���B�s,�ؑ������E������F����,���N�]�E�j�b�R�E�{�T�c�����E�]�E�@���N�]�E�K�b�R�E�{�T�c�����E�]�E,,,���w��L�`������,���p�H�|�i,���Ύ�,��茧���B�s���򍕐Β����R��17,,39.084318,141.20659,0197-35-2111,,2,��,,���Ύ�,1976/3/23,,,,,,,,,,,,
32158,36,��茧,���B�s,�ؑ��\��_����,���N�]�E�W���E�j�V���V���E�]�E,,,���w��L�`������,���p�H�|�i,���Ύ�,��茧���B�s���򍕐Β����R��17,,39.084318,141.20659,0197-35-2111,,12,��,,���Ύ�,1976/3/23,,,,,,,,,,,,
32158,37,��茧,���B�s,�ؑ�����ɔ@������,���N�]�E�A�~�_�j�����C�����E�]�E,,,���w��L�`������,���p�H�|�i,,��茧���B�s����^�鎚������,,,,0197-35-2111,,1,��,,�l,1985/9/17,,,,,,,,,,,,
32158,38,��茧,���B�s,�ؑ��߉ޔ@������,���N�]�E�V���J�j�����C�U�]�E,,,���w��L�`������,���p�H�|�i,���鎛,��茧���B�s�]�h�c��������7,,39.182183,141.210125,0197-35-2111,,1,��,,���鎛,1991/8/27,,,,,,,,,,,,
32158,39,��茧,���B�s,�ؑ��n����F����,���N�]�E�W�]�E�{�T�c�U�]�E,,,���w��L�`������,���p�H�|�i,������,��茧���B�s�]�h�쒬8-17,,39.190428,141.184245,0197-35-2111,,1,��,,������,1991/8/27,,,,,,,,,,,,
32158,40,��茧,���B�s,�ؑ��߉ގO�������@�P�߉ޔ@�������@�Q�����F�����@�R������F����,���N�]�E�V���J�T���]���U�]�E,,,���w��L�`������,���p�H�|�i,���@��,��茧���B�s���򍕐Β������@��129,,39.068136,141.224939,0197-35-2111,,3,��,,���@��,1997/5/2,,,,,,,,,,,,
32158,41,��茧,���B�s,�ؑ����ω�����,���N�]�E�Z���W���J���m�������E�]�E,,,�s�w��L�`������,���p�H�|�i,,��茧���B�s�O�򐶕ꎚ����,,,,0197-35-2111,,1,��,,�l,1973/1/1,,,,,,,,,,,,
32158,42,��茧,���B�s,�ؑ��߉ޔ@������(�O�򏉎q�����j�@���@�~�q�A�߉ޓ��n���L�ΔA�߉ޓ����D,���N�]�E�V���J�j�����C�����E�]�E�i�~�T���n�c�R�W�u�c�j,,,�s�w��L�`������,���p�H�|�i,�v����,��茧���B�s�O�򎚎R��181,,39.060191,141.122108,0197-35-2111,,4,�_,,�v����,1973/12/20,,,,,,,,,,,,
32158,43,��茧,���B�s,�ؑ��\��ʊω�����,���N�]�E�W���E�C�`�����J���m�������E�]�E,,,�s�w��L�`������,���p�H�|�i,�쓍��,��茧���B�s�O�򎚎R��72,,39.052629,141.120533,0197-35-2111,,1,��,,�쓍��,1974/10/1,,,,,,,,,,,,
32158,44,��茧,���B�s,�����ۖ{�܊Ŕ�,�L�����C�K���z���|�J���o��,,,�s�w��L�`������,���p�H�|�i,,��茧���B�s�O�򎚎�������,,,,0197-35-2111,,1,�_,,�l,1974/10/1,,,,,,,,,,,,
32158,45,��茧,���B�s,�ؑ��ܕS������,���N�]�E�S�q���N���J���]�E,,,�s�w��L�`������,���p�H�|�i,���⎛,��茧���B�s�O�򎚉����H84,,39.042997,141.119544,0197-35-2111,,28,��,,���⎛,1976/3/1,,,,,,,,,,,,
32158,46,��茧,���B�s,�ؑ��m�`�����O,���N�]�E�\�E�M���E�U�]�E�z�J,,,�s�w��L�`������,���p�H�|�i,���q�������_��,��茧���B�s�]�h�������q��39,,39.191949,141.266368,0197-35-2111,,8,��,,���q�������_��,1981/5/19,,,,,,,,,,,,
32158,47,��茧,���B�s,�ؑ�������V����,���N�]�E�r�V�������e�������E�]�E�@,,,�s�w��L�`������,���p�H�|�i,���������y������,��茧���B�s�]�h��J����������102-1,,39.196154,141.191094,0197-35-2111,,1,��,,�����ێ�����,1981/5/19,,,,,,,,,,,,
32158,48,��茧,���B�s,�ؑ����ω�����,���N�]�E�V���E�J���m�������E�]�E,,,�s�w��L�`������,���p�H�|�i,���������y������,��茧���B�s�]�h��J����������102-1,,39.196154,141.191094,0197-35-2111,,1,��,,���R�_��,1981/5/19,,,,,,,,,,,,
32158,49,��茧,���B�s,�ؑ��\��ʊω�����,���N�]�E�W���E�C�`�����J���m�������E�]�E�@,,,�s�w��L�`������,���p�H�|�i,�ʍ��`�_��,��茧���B�s�]�h�ʗ����ʍ�498,,39.215049,141.207699,0197-35-2111,,1,��,,�ʍ��`�_��,1981/5/19,,,,,,,,,,,,
32158,50,��茧,���B�s,���q��,�V�V�K�V��,,,�s�w��L�`������,���p�H�|�i,,��茧���B�s�]�h���쎚����,,,,0197-35-2111,,1,��,,���R�_��,1981/5/19,,,,,,,,,,,,
32158,51,��茧,���B�s,�ؑ��_��,���N�]�E�V������,,,�s�w��L�`������,���p�H�|�i,,��茧���B�s�]�h�c������c,,,,0197-35-2111,,2,��,,�l,1981/5/19,,,,,,,,,,,,
32158,52,��茧,���B�s,�ؑ��n����F����,���N�]�E�W�]�E�{�T�c�U�]�E,,,�s�w��L�`������,���p�H�|�i,,��茧���B�s�_�򏬎R���X,,,,0197-35-2111,,1,��,,�l,1982/7/7,,,,,,,,,,,,
32158,53,��茧,���B�s,��������������,�h�E�]�E�U�I�E�S���Q���]�E,,,�s�w��L�`������,���p�H�|�i,,��茧���B�s�_�򏬎R���X,,,,0197-35-2111,,1,�_,,�l,1982/7/7,,,,,,,,,,,,
32158,54,��茧,���B�s,�ؑ��\��ʊω���F����,���N�]�E�W���E�C�`�����J���m���{�T�c�U�]�E,,,�s�w��L�`������,���p�H�|�i,�P����,��茧���B�s�_����������127,,39.132679,141.055708,0197-35-2111,,1,��,,�P����,1982/7/7,,,,,,,,,,,,
32158,55,��茧,���B�s,�ؑ��R�_����,���N�]�E���}�m�J�~�����E�]�E,,,�s�w��L�`������,���p�H�|�i,,��茧���B�s�_�������㎭��,,,,0197-35-2111,,3,��,,�l,1982/7/7,,,,,,,,,,,,
32158,56,��茧,���B�s,�ؑ��F�{���q����,���N�]�E�L���E���E�^�C�V�����E�]�E,,,�s�w��L�`������,���p�H�|�i,���ˎ�,��茧���B�s�ߐ약23-1,,39.014811,141.079818,0197-35-2111,,1,��,,���ˎ�,1989/6/27,,,,,,,,,,,,
32158,57,��茧,���B�s,�ؑ��n����F����,���N�]�E�W�]�E�{�T�c�U�]�E,,,�s�w��L�`������,���p�H�|�i,,��茧���B�s�ߐ�Z��,,,,0197-35-2111,,1,��,,�l,1989/6/27,,,,,,,,,,,,
32158,58,��茧,���B�s,���P�ω�,�i�J�[���J���m��,,,�s�w��L�`������,���p�H�|�i,���������y������,��茧���B�s�]�h��J����������102-1,,39.196154,141.191094,0197-35-2111,,138,�_,,�l,2000/3/6,,,,,,,,,,,,
32158,59,��茧,���B�s,�˒|��������U���@��������t���i�ꊇ,�L���^�P�����A���N�W���E�P�T�@�c�P�^���c�c�~�M���i�h�t�]�N�q���C�b�J�c,,,���w��L�`������,���p�H�|�i,���@��,��茧���B�s���򍕐Β������@��129,,39.068136,141.224939,0197-35-2111,,7,�_,,���@��,1972/10/27,,,,,,,,,,,,
32158,60,��茧,���B�s,�Z���@���@���B��������,�^���g�E�@���C�@�I�E�V���E���N�T�~�c�i�K,,,���w��L�`������,���p�H�|�i,���������y������,��茧���B�s�]�h��J����������102-1,,39.196154,141.191094,0197-35-2111,,1,�{,,���B�s,1978/4/4,,,,,,,,,,,,
32158,61,��茧,���B�s,���O��������,�h�E�T���]���]�E�J�P�{�g�P,,,���w��L�`������,���p�H�|�i,���������y������,��茧���B�s�]�h��J����������102-1,,39.196154,141.191094,0197-35-2111,,1,�_,,�l,1980/3/4,,,,,,,,,,,,
32158,62,��茧,���B�s,���@���@�V�������`,�J�^�i�@���C�@�V���h�E�~�i���g�m�N�j���V,,,���w��L�`������,���p�H�|�i,���������y������,��茧���B�s�]�h��J����������102-1,,39.196154,141.191094,0197-35-2111,,1,�{,,���B�s,1980/10/3,,,,,,,,,,,,
32158,63,��茧,���B�s,�ތہ@���@���ˁE����,�V���E�R�@�c�P�^���@�P���J�@�V�����N,,,���w��L�`������,���p�H�|�i,,��茧���B�s�]�h���쎚����,,,,0197-35-2111,,1,��,,�l,1988/10/18,,,,,,,,,,,,
32158,64,��茧,���B�s,�ތ�,�V���E�R,,,���w��L�`������,���p�H�|�i,���������y������,��茧���B�s�]�h��J����������102-1,,39.196154,141.191094,0197-35-2111,,1,��,,�l,1988/10/18,,,,,,,,,,,,
32158,65,��茧,���B�s,�������ω���������,�R���h�E�V���E�J���m���U�]�E�J�P�{�g�P,,,���w��L�`������,���p�H�|�i,�V�R�_��,��茧���B�s�]�h����R��,,,,0197-35-2111,,1,��,,�V�R�_��,1988/10/18,,,,,,,,,,,,
32158,66,��茧,���B�s,��,�P��,,,���w��L�`������,���p�H�|�i,��茧��������,��茧�����s��c�������~34,,39.755483,141.154027,0197-35-2111,,1,�{,,�l,1988/10/18,,,,,,,,,,,,
32158,67,��茧,���B�s,����,�h�E�V���E,,,�s�w��L�`������,���p�H�|�i,��{��,��茧���B�s����H�c�����剺80,,39.122293,141.209469,0197-35-2111,,1,��,,��{��,1957/3/30,,,,,,,,,,,,
32158,68,��茧,���B�s,�������ہi�����ہj,�i�K�h�E�^�C�R�i�g�L�m�^�C�R�j,,,�s�w��L�`������,���p�H�|�i,������,��茧���B�s���򎛏��H33,,39.142696,141.143584,0197-35-2111,,1,��,,������,1974/4/1,,,,,,,,,,,,
32158,69,��茧,���B�s,�������,�R���h�E�P�}��,,,�s�w��L�`������,���p�H�|�i,,��茧���B�s���򍕐Β������c,,,,0197-35-2111,,1,�_,,�l,1974/4/1,,,,,,,,,,,,
32158,70,��茧,���B�s,�Γ��U,�C�V�h�E���E,,,�s�w��L�`������,���p�H�|�i,�����_��,��茧���B�s����������H14,,39.142725,141.132148,0197-35-2111,,6,��,,�����_��,1974/4/1,,,,,,,,,,,,
32158,71,��茧,���B�s,�Γ��U,�C�V�h�E���E,,,�s�w��L�`������,���p�H�|�i,�����,��茧���B�s���򓌒�4-1,,39.139139,141.14302,0197-35-2111,,1,��,,�����,1974/4/1,,,,,,,,,,,,
32158,72,��茧,���B�s,����,�h�E�V���E,,,�s�w��L�`������,���p�H�|�i,�����,��茧���B�s���򓌒�2,,39.139139,141.14302,0197-35-2111,,1,��,,�����,1981/3/30,,,,,,,,,,,,
32158,73,��茧,���B�s,����,�h�E�V���E,,,�s�w��L�`������,���p�H�|�i,���Ύ�,��茧���B�s���򍕐Β����R��17,,39.084318,141.20659,0197-35-2111,,1,��,,���Ύ�,1981/3/30,,,,,,,,,,,,
32158,74,��茧,���B�s,��������ɔ@����������,�R���h�E�A�~�_�j�����C�U�]�E�J�P�{�g�P,,,�s�w��L�`������,���p�H�|�i,,��茧���B�s�ߐ쉺�͓�,,,,0197-35-2111,,1,�_,,�l,1989/6/27,,,,,,,,,,,,
32158,75,��茧,���B�s,���k��,�h�E���j�O�`,,,�s�w��L�`������,���p�H�|�i,,��茧���B�s�ߐ쎚�R��,,,,0197-35-2111,,1,�_,,���R�_��,1989/6/27,,,,,,,,,,,,
32158,76,��茧,���B�s,����,�J�P�{�g�P,,,�s�w��L�`������,���p�H�|�i,���������y������,��茧���B�s�]�h��J����������102-1,,39.196154,141.191094,0197-35-2111,,7,�_,,�[�R�_��,1997/8/1,,,,,,,,,,,,
32158,77,��茧,���B�s,�ތ�,�V���E�R,,,�s�w��L�`������,���p�H�|�i,,��茧���B�s�]�h�c�����V�c,,,,0197-35-2111,,1,��,,�l,1997/8/1,,,,,,,,,,,,
32158,78,��茧,���B�s,�ؐ�����i�ؕr�E�����j,���N�Z�C�L���E�O�i�P�r���E�E�^�J�c�L�j,,,�s�w��L�`������,���p�H�|�i,���q�������_��,��茧���B�s�]�h�������q��39,,39.191949,141.266368,0197-35-2111,,5,�_,,���q�������_��,2000/3/6,,,,,,,,,,,,
32158,79,��茧,���B�s,�����^�`�S����,�����E�����V���i���e�c���K�},,,�s�w��L�`������,���p�H�|�i,,��茧���B�s����H�c�������c,,,,0197-35-2111,,1,��,,�l,2005/9/30,,,,,,,,,,,,
32158,80,��茧,���B�s,���{�n�����@�ᑠ  ���@���@�ᑠ�G��,�V�z���{�N�V���V���E�{�E�Q���]�E�i�c�P�^���V���E�{�E�Q���]�E�U�c�u���j,,,���w��L�`������,���p�H�|�i,���@��,��茧���B�s���򍕐Β������@��129,,39.068136,141.224939,0197-35-2111,,29,��,,���@��,1959/3/17,,,,,,,,,,,,
32158,81,��茧,���B�s,����ƕ���,���X�P�����W��,,,�d�v������,���p�H�|�i,����}����,��茧���B�s���򍲑q�͎��΋�51,,39.1457,141.153317,0197-35-2111,,107,��,,���B�s,1995/6/15,,,,,,,,,,,,
32158,82,��茧,���B�s,���P������,�~���E�[���W�����W��,,,�s�w��L�`������,���p�H�|�i,�_�򋽓y������,��茧���B�s�_���s�c������J�n1-1,,39.119419,141.069449,0197-35-2111,,1,�_,,���P��,1986/2/1,,,,,,,,,,,,
32158,83,��茧,���B�s,���R�̋v�یܓ��ƕ���,�I���}�m�N�{�S�g�E�Q�����W��,,,�s�w��L�`������,���p�H�|�i,�_�򋽓y������,��茧���B�s�_���s�c������J�n1-1,,39.119419,141.069449,0197-35-2111,,262,�_,,�l,1996/12/10,,,,,,,,,,,,
32158,84,��茧,���B�s,����̖��n��c�ƕ���,���J���i�M�m�A�u���W�`�_�P�����W��,,,�s�w��L�`������,���p�H�|�i,�_�򋽓y������,��茧���B�s�_���s�c������J�n1-1,,39.119419,141.069449,0197-35-2111,,458,�_,,���B�s,1996/12/10,,,,,,,,,,,,
32158,85,��茧,���B�s,����̑y�V�������ƕ���,���J���i�M�m�\�E�m�}�`�A�x�P�����W��,,,�s�w��L�`������,���p�H�|�i,�_�򋽓y������,��茧���B�s�_���s�c������J�n1-1,,39.119419,141.069449,0197-35-2111,,4576,�_,,���B�s,1996/12/10,,,,,,,,,,,,
32158,86,��茧,���B�s,�V���̒����~��c�ƕ���,�j�C�T�g�m�i�J���V�L�`�_�P�����W��,,,�s�w��L�`������,���p�H�|�i,�_�򋽓y������,��茧���B�s�_���s�c������J�n1-1,,39.119419,141.069449,0197-35-2111,,853,�_,,���B�s,2001/6/1,,,,,,,,,,,,
32158,87,��茧,���B�s,�p�ˌÕ��o�y����,�c�m�d�J�R�t���V���c�h�n�j��,,,���w��L�`������,���p�H�|�i,�_�򋽓y������,��茧���B�s�_���s�c������J�n1-1,,39.119419,141.069449,0197-35-2111,,,,,���B�s,1990/8/28,,,,,,,,,,,,
32158,88,��茧,���B�s,�Ε���,�C�V�{�E�`���E,,,���w��L�`������,���p�H�|�i,�_�򋽓y������,��茧���B�s�_���s�c������J�n1-1,,39.119419,141.069449,0197-35-2111,,2,�_,,�l,1990/8/28,,,,,,,,,,,,2�_�̓�1�_�͊�茧�������قɏ���
32158,89,��茧,���B�s,�����l����,�n�N�W�V�W�R,,,�s�w��L�`������,���p�H�|�i,���������y������,��茧���B�s�]�h��J����������102-1,,39.196154,141.191094,0197-35-2111,,1,�_,,���B�s,1972/1/25,,,,,,,,,,,,
32158,90,��茧,���B�s,�Õ��̂��隭�^�y��,�A�������m�A���c�L�K�^�h�L,,,�s�w��L�`������,���p�H�|�i,�_�򋽓y������,��茧���B�s�_���s�c������J�n1-1,,39.119419,141.069449,0197-35-2111,,1,�_,,���B�s,1986/2/1,,,,,,,,,,,,
32158,91,��茧,���B�s,�{�b�횭�^�y��,�X�G�L�c�L�K�^�h�L,,,�s�w��L�`������,���p�H�|�i,�_�򋽓y������,��茧���B�s�_���s�c������J�n1-1,,39.119419,141.069449,0197-35-2111,,1,�_,,���B�s,1986/2/1,,,,,,,,,,,,
32158,92,��茧,���B�s,�o��,�L���E�c�{,,,�s�w��L�`������,���p�H�|�i,���������y������,��茧���B�s�]�h��J����������102-1,,39.196154,141.191094,0197-35-2111,,1,�_,,�l,2000/3/6,,,,,,,,,,,,
32158,93,��茧,���B�s,�{�b��n�g�󕶎l����,�X�G�L�P�C�n�W���E�����V�W�R,,,�s�w��L�`������,���p�H�|�i,���������y������,��茧���B�s�]�h��J����������102-1,,39.196154,141.191094,0197-35-2111,,1,�_,,���B�s,2001/5/7,,,,,,,,,,,,
32158,94,��茧,���B�s,���쒷�p�֌W����,�^�J�m�`���E�G�C�J���P�C�V�����E,,,�d�v������,���p�H�|�i,���쒷�p�L�O��,��茧���B�s���򒆏�쒬1-9,,39.135844,141.141009,0197-35-2111,,58,�_,,���B�s,1996/6/27,,,,,,,,,,,,
32158,95,��茧,���B�s,�䌫�ق̔Ŗ�,�q�P���J���m�n���M,,,�s�w��L�`������,���p�H�|�i,���������y������,��茧���B�s�]�h��J����������102-1,,39.196154,141.191094,0197-35-2111,,17.5,��,,�l,1965/3/4,,,,,,,,,,,,
32158,96,��茧,���B�s,���쒷�p�����p�M�����i�`�܏��j,�^�J�m�`���E�G�C�S�N�`���E�J�N�q�c�V�u��(�f���c���K�L),,,�s�w��L�`������,���p�H�|�i,���쒷�p�L�O��,��茧���B�s���򒆏�쒬1-9,,39.135844,141.141009,0197-35-2111,,1,��,,�l,1973/1/1,,,,,,,,,,,,
32158,97,��茧,���B�s,�V�[�{���g����ⳁ@,�V�[�{���g�V���z�E�Z��,,,�s�w��L�`������,���p�H�|�i,���쒷�p�L�O��,��茧���B�s���򒆏�쒬1-9,,39.135844,141.141009,0197-35-2111,,1,��,,�l,1973/1/1,,,,,,,,,,,,
32158,98,��茧,���B�s,�C�����k�i�Ŗ{�j,�J�C�R�N�w�C�_���i�n���|���j,,,�s�w��L�`������,���p�H�|�i,,��茧���B�s�O�򎚉����H,,,,0197-35-2111,,3,��,,�l,1973/1/1,,,,,,,,,,,,
32158,99,��茧,���B�s,�����㌴���v�i�Ŗ{�j�@,�Z�C�Z�c�C�Q���X�E���E,,,�s�w��L�`������,���p�H�|�i,���쒷�p�L�O��,��茧���B�s���򒆏�쒬1-9,,39.135844,141.141009,0197-35-2111,,1,��,,�l,1973/12/20,,,,,,,,,,,,
32158,100,��茧,���B�s,�s��X�̎Z�z,�C�`�m�m�m�T���K�N,,,�s�w��L�`������,���p�H�|�i,�_�򋽓y������,��茧���B�s�_���s�c������J�n1-1,,39.119419,141.069449,0197-35-2111,,1,��,,�l,1986/2/1,,,,,,,,,,,,
32158,101,��茧,���B�s,���ύ�̎Z�z,�P�V���E�U�J�m�T���K�N,,,�s�w��L�`������,���p�H�|�i,,��茧���B�s�_���s�c�����ύ�,,,,0197-35-2111,,1,��,,�l,1986/2/1,,,,,,,,,,,,
32158,102,��茧,���B�s,����V���\�G�},�J�~�C�T���Q�����N�G�Y,,,�s�w��L�`������,���p�H�|�i,�_�򋽓y������,��茧���B�s�_���s�c������J�n1-1,,39.119419,141.069449,0197-35-2111,,1,��,,���B�s,1986/2/1,,,,,,,,,,,,
32158,103,��茧,���B�s,��䐅��Z��{�^���s����Γ�e,�Z���_�C�~�Y�T���W���E�T�J���g�E���W���L�����T�N�q�i���W���E,,,�s�w��L�`������,���p�H�|�i,,��茧���B�s���򓌏�쒬,,,,0197-35-2111,,1,��,,�l,1997/1/7,,,,,,,,,,,,
32158,104,��茧,���B�s,���P�Z�z,�i�J�[���T���K�N,,,�s�w��L�`������,���p�H�|�i,���������y������,��茧���B�s�]�h��J����������102-1,,39.196154,141.191094,0197-35-2111,,2,��,,�l,2001/5/7,,,,,,,,,,,,
32158,105,��茧,���B�s,���̖��߁i�a���X�������j,�g���m�i�N�l�i���X���J�^�~�j,,,�s�w��L�`������,���p�H�|�i,���쒷�p�L�O��,��茧���B�s���򒆏�쒬1-9,,39.135844,141.141009,0197-35-2111,,1,��,,���B�s,2013/10/30,,,,,,,,,,,,
32158,106,��茧,���B�s,���΂̏\�O��,�N���C�V�m�W���E�T���d�J,,,�d�v�L�`����������,,,��茧���B�s���򍕐Β�������,,39.086023,141.193991,0197-35-2111,,13,��,,���B�s;�l,1993/12/13,,,,,,,,,,,,
32158,107,��茧,���B�s,����[�D,�W�������C�m�E�T�c,,,���w��L�`����������,,�ʍ��`�_��,��茧���B�s�]�h�ʗ����ʍ�498,,39.215049,141.207699,0197-35-2111,,1,��,,�ʍ��`�_��,1979/8/17,,,,,,,,,,,,
32158,108,��茧,���B�s,�܂���̕�,�}�C���m�z�g�P,,,���w��L�`����������,,,��茧���B�s�]�h��J�����_��c,,,,0197-35-2111,,2,��,,�l,1985/2/5,,,,,,,,,,,,
32158,109,��茧,���B�s,�܂���̕�,�}�C���m�z�g�P,,,���w��L�`����������,,�L����,��茧���B�s�]�h����L��91,,39.214301,141.160477,0197-35-2111,,1,��,,�L����,1985/2/5,,,,,,,,,,,,
32158,110,��茧,���B�s,�o�̍M�\���i���i�\��N���j,�A�l�^�C�R�E�V���g�E(�J���G�C�W���E�j�l�����C),,,���w��L�`����������,,,��茧���B�s����o�̒����M�\��,,,,0197-35-2111,,1,��,,�l,2013/11/5,,,,,,,,,,,,
32158,111,��茧,���B�s,���q�͓��L���̂܂���̕�,�T�N���K���q�K�V�q���}�`�m�}�C���m�z�g�P,,,�s�w��L�`����������,,,��茧���B�s���򍲑q�͎����L��,,,,0197-35-2111,,1,��,,�l,1974/4/1,,,,,,,,,,,,
32158,112,��茧,���B�s,�D�G�n,�t�i�G�},,,�s�w��L�`����������,,�����_��,��茧���B�s�]�h�����������쌴197,,39.175617,141.154554,0197-35-2111,,4,��,,�����_��,1981/5/19,,,,,,,,,,,,
32158,113,��茧,���B�s,���������̒Ǖ���,�I���]�N�i�K�l�m�I�C���P�C�V,,,�s�w��L�`����������,,,��茧���B�s�_�򏬎R���㉶��,,,,0197-35-2111,,1,��,,�l,1982/7/7,,,,,,,,,,,,
32158,114,��茧,���B�s,�����̒Ǖ���,�R�N�u���m�I�C���P�C�V,,,�s�w��L�`����������,,,��茧���B�s�_���s�c������,,,,0197-35-2111,,1,��,,�l,1982/7/7,,,,,,,,,,,,
32158,115,��茧,���B�s,���ύ�̒Ǖ���,�P�V���E�U�J�m�I�C���P�C�V,,,�s�w��L�`����������,,,��茧���B�s�_���s�c�����ύ�,,,,0197-35-2111,,1,��,,�l,1982/7/7,,,,,,,,,,,,
32158,116,��茧,���B�s,���܂̒Ǖ���,�Z�L�u�N���m�I�C���P�C�V,,,�s�w��L�`����������,,,��茧���B�s�_����������,,,,0197-35-2111,,1,��,,�l,1982/7/7,,,,,,,,,,,,
32158,117,��茧,���B�s,���{�˂̒Ǖ��΁i�n����j,�N���E�d�J�m�I�C���P�C�V�i�o�g�E�q�j,,,�s�w��L�`����������,,,��茧���B�s�_������������,,,,0197-35-2111,,1,��,,�l,1982/7/7,,,,,,,,,,,,
32158,118,��茧,���B�s,�����̒Ǖ���,�n�o�V�^�m�I�C���P�C�V,,,�s�w��L�`����������,,,��茧���B�s�_����������,,,,0197-35-2111,,1,��,,�l,1982/7/7,,,,,,,,,,,,
32158,119,��茧,���B�s,���{�˂̒Ǖ��΁i�����喾�_�j,�N���E�d�J�m�I�C���P�C�V�i�J�V�}�_�C�~���E�W���j,,,�s�w��L�`����������,,,��茧���B�s�_��������{��,,,,0197-35-2111,,1,��,,�s�R�����{�ˎ��x�ۑ���,1982/7/7,,,,,,,,,,,,
32158,120,��茧,���B�s,�s��X�̒Ǖ���,�C�`�m�m�m�I�C���P�C�V,,,�s�w��L�`����������,,,��茧���B�s�_�������{��,,,,0197-35-2111,,1,��,,�l,1982/7/7,,,,,,,,,,,,
32158,121,��茧,���B�s,�َR�̔�(���c�̔�),�^�e���}�m�C�^�r�i�G���P�C�m�q�j,,,�s�w��L�`����������,,,��茧���B�s�]�h��J�����ى�,,39.198233,141.182738,0197-35-2111,,1,��,,���B�s,1985/2/19,,,,,,,,,,,,
32158,122,��茧,���B�s,���Ă̔�(�×�̔�),�R�}�S���m�C�^�r�i�J�����N�m�q�j,,,�s�w��L�`����������,,���������y������,��茧���B�s�]�h��J����������102-1,,39.196154,141.191094,0197-35-2111,,2,��,,���B�s,1985/2/19,,,,,,,,,,,,
32158,123,��茧,���B�s,�َR�̔�i�N�i�̔�j,�^�e���}�m�C�^�r�i�R�E�G�C�m�q�j,,,�s�w��L�`����������,,���������y������,��茧���B�s�]�h��J����������102-1,,39.196154,141.191094,0197-35-2111,,1,��,,�l,1985/2/19,,,,,,,,,,,,